program: Orca
programVersion: 5.0.4
elementType: S S S P O O C C C C C C C C H H H H H H H H H H H H H H H H H H H
charge: 0
multiplicity: 1
keywords: wb97x-d3
keywords: def2-TZVPP
keywords: def2/J RIJCOSX
keywords: DEFGRID2
keywords: scfconv7
keywords: smallprint printgap noloewdin
keywords: NOSOSCF
formula: C8H19O2PS3
InChI: InChI=1/C8H19O2PS3/c1-4-9-11(12,10-5-2)14-8-7-13-6-3/h4-8H2,1-3H3
33 atoms
S  0.226093 -0.468151 1.843727
S  -3.648487 -0.961128 -0.259232
S  2.952213 1.158463 1.015782
P  1.386144 0.300138 0.298457
O  1.619539 -0.912967 -0.721338
O  0.430961 1.156292 -0.657459
C  -1.177034 -1.231389 0.937293
C  -2.363163 -0.292347 0.832106
C  2.425847 -2.044638 -0.348417
C  0.429661 2.596942 -0.672181
C  -2.941664 -0.531005 -1.879977
C  2.86713 -2.743479 -1.608277
C  -0.255882 3.202867 0.52714
C  -3.080071 0.936127 -2.234456
H  -1.439644 -2.12611 1.501835
H  -0.825726 -1.563973 -0.038763
H  -2.065061 0.692019 0.473135
H  -2.821832 -0.147466 1.811037
H  3.291064 -1.709332 0.229098
H  1.834743 -2.710524 0.284499
H  1.456393 2.957972 -0.757044
H  -0.091482 2.861336 -1.591312
H  -1.896856 -0.847109 -1.911188
H  -3.473588 -1.151521 -2.603442
H  2.016631 -3.089641 -2.196469
H  3.481414 -2.092796 -2.231132
H  3.465802 -3.615159 -1.342535
H  -0.278868 4.286836 0.404765
H  -1.285567 2.858031 0.626169
H  0.274713 2.988774 1.455375
H  -4.127894 1.229508 -2.301247
H  -2.597662 1.582736 -1.499768
H  -2.611566 1.136091 -3.200637
elementType: S P O C H
totalener: -2002.88611749 hartree
nucrepener: 1552.44928347 hartree
electener: -3555.33540096 hartree
oneelecener: -5847.54526245 hartree
twoeener: 2292.20986150 hartree
cpcmener: -0.01864918 hartree
kineticenergy: 1997.83392605 hartree
xcener: -120.676717415454 hartree
chargesum: -0.0000000
charge: -0.175046 -0.183044 -0.445048 0.622614 -0.341095 -0.346599 -0.112619 -0.092773 0.034282 0.019279 -0.099174 -0.242444 -0.254845 -0.253671 0.133360 0.114001 0.063891 0.132129 0.099448 0.098284 0.107821 0.112723 0.089836 0.109900 0.088649 0.087171 0.087425 0.107374 0.096972 0.084130 0.089015 0.072103 0.095951
qa: -0.1750 -0.1830 -0.4450 0.6226 -0.3411 -0.3466 -0.1126 -0.0928 0.0343 0.0193 -0.0992 -0.2424 -0.2548 -0.2537 0.1334 0.1140 0.0639 0.1321 0.0994 0.0983 0.1078 0.1127 0.0898 0.1099 0.0886 0.0872 0.0874 0.1074 0.0970 0.0841 0.0890 0.0721 0.0960
va: 2.2727 2.1652 2.0179 5.4437 2.0943 2.0800 3.8712 3.9626 3.8296 3.8212 3.9318 3.9655 3.9047 3.9247 1.0137 1.0230 1.0382 1.0090 1.0084 0.9956 1.0175 0.9893 1.0158 1.0031 1.0028 1.0062 1.0064 1.0107 0.9937 1.0188 1.0141 1.0003 1.0045
dispcorr: -0.016841081 hartree
energy: -2002.902958570028
dipole: -8.64277 7.90253 -0.74024 0.89411 -1.25196 -0.35785 -12.70836 11.67452 -1.03385
magnitude: 1.32093 au
magnitude: 3.35753 debye
