program: Orca
programVersion: 5.0.4
elementType: S S S P O O C C C C C C C C H H H H H H H H H H H H H H H H H H H
charge: 0
multiplicity: 1
keywords: wb97x-d3
keywords: def2-TZVPP
keywords: def2/J RIJCOSX
keywords: DEFGRID2
keywords: scfconv7
keywords: smallprint printgap noloewdin
keywords: NOSOSCF
formula: C8H19O2PS3
InChI: InChI=1/C8H19O2PS3/c1-4-9-11(12,10-5-2)14-8-7-13-6-3/h4-8H2,1-3H3
33 atoms
S  0.134706 -1.487731 -1.10194
S  -2.478808 0.766972 -1.180402
S  0.441089 -0.641345 2.17806
P  0.975015 -0.253778 0.375094
O  2.521132 -0.45637 -0.007412
O  0.748633 1.27054 -0.018042
C  -1.544043 -1.799625 -0.476411
C  -2.62191 -1.031222 -1.222206
C  3.225722 -1.638656 0.396022
C  0.970728 1.783614 -1.339278
C  -2.770821 1.142044 0.571927
C  4.109416 -1.348381 1.585806
C  0.467576 3.204748 -1.380478
C  -4.175918 0.8239 1.045914
H  -1.55518 -1.599116 0.596671
H  -1.712764 -2.871393 -0.596892
H  -3.600189 -1.339996 -0.845769
H  -2.60456 -1.289456 -2.282238
H  2.523913 -2.445717 0.623701
H  3.813014 -1.950459 -0.468244
H  2.03765 1.740101 -1.570443
H  0.432524 1.167896 -2.063046
H  -2.016892 0.655179 1.192572
H  -2.575361 2.213116 0.647884
H  4.812703 -0.544955 1.368995
H  3.513749 -1.066666 2.452788
H  4.684222 -2.238757 1.842614
H  0.63782 3.620438 -2.373724
H  -0.602293 3.245249 -1.180301
H  0.983733 3.835601 -0.657726
H  -4.923336 1.330867 0.437008
H  -4.38463 -0.24573 1.011385
H  -4.306204 1.14086 2.081689
totalener: -2002.86523033 hartree
nucrepener: 1588.07965484 hartree
electener: -3590.94488517 hartree
oneelecener: -5919.44252489 hartree
twoeener: 2328.49763973 hartree
kineticenergy: 1997.89697431 hartree
xcener: -120.693129344720 hartree
chargesum: -0.0000000
charge: -0.170430 -0.126212 -0.390312 0.639145 -0.344369 -0.291337 -0.107200 -0.166265 0.015803 -0.031499 -0.104162 -0.219896 -0.214390 -0.242965 0.107357 0.117556 0.102909 0.111301 0.081606 0.095516 0.116515 0.099786 0.085733 0.097149 0.082547 0.086541 0.077559 0.076714 0.075360 0.090596 0.088232 0.070153 0.090958
qa: -0.1704 -0.1262 -0.3903 0.6391 -0.3444 -0.2913 -0.1072 -0.1663 0.0158 -0.0315 -0.1042 -0.2199 -0.2144 -0.2430 0.1074 0.1176 0.1029 0.1113 0.0816 0.0955 0.1165 0.0998 0.0857 0.0971 0.0825 0.0865 0.0776 0.0767 0.0754 0.0906 0.0882 0.0702 0.0910
va: 2.2791 2.1998 2.0643 5.4266 2.1006 2.1354 3.8328 3.9991 3.9038 3.8856 3.9237 3.9290 3.9349 3.9449 1.0489 1.0094 1.0063 1.0091 1.0130 0.9928 0.9982 1.0058 1.0510 1.0086 1.0056 1.0229 1.0102 1.0090 1.0161 1.0050 1.0121 1.0036 1.0055
dispcorr: -0.016730671 hartree
energy: -2002.881961001099
dipole: -4.60475 4.63442 0.02967 4.74811 -5.10044 -0.35232 -0.02154 -0.64433 -0.66587
magnitude: 0.75392 au
magnitude: 1.91631 debye
