program: Orca
programVersion: 5.0.4
elementType: S S S P O O C C C C C C C C H H H H H H H H H H H H H H H H H H H
charge: 0
multiplicity: 1
keywords: wb97x-d3
keywords: def2-TZVPP
keywords: def2/J RIJCOSX
keywords: DEFGRID2
keywords: scfconv7
keywords: smallprint printgap noloewdin
keywords: NOSOSCF
formula: C8H19O2PS3
InChI: InChI=1/C8H19O2PS3/c1-4-9-11(12,10-5-2)14-8-7-13-6-3/h4-8H2,1-3H3
33 atoms
S  0.438738 -0.631924 -1.759154
S  -3.484267 -1.456563 0.151006
S  0.231214 1.333417 1.008907
P  1.402216 0.388373 -0.196391
O  2.417402 -0.687305 0.411072
O  2.507085 1.264263 -0.944616
C  -1.323756 -0.521668 -1.294134
C  -1.725201 -1.560872 -0.266881
C  1.985784 -1.912587 1.005135
C  2.298792 2.64635 -1.25308
C  -3.470045 -0.074256 1.331786
C  1.629562 -1.75541 2.467545
C  1.313177 2.861266 -2.380858
C  -2.90972 -0.437108 2.694091
H  -1.869251 -0.669747 -2.226337
H  -1.524119 0.490077 -0.943969
H  -1.128657 -1.457037 0.6405
H  -1.555207 -2.565847 -0.655386
H  1.149208 -2.332298 0.437335
H  2.825846 -2.596792 0.885877
H  1.975757 3.176685 -0.354171
H  3.285752 3.017535 -1.526509
H  -2.92816 0.770169 0.901928
H  -4.514457 0.231371 1.413576
H  1.393803 -2.733628 2.887714
H  2.461408 -1.337776 3.033504
H  0.766268 -1.106867 2.609083
H  1.585945 2.289841 -3.267059
H  0.30064 2.582664 -2.089811
H  1.299587 3.918256 -2.648491
H  -1.857678 -0.715465 2.633579
H  -2.973971 0.417125 3.370018
H  -3.458076 -1.267554 3.13701
totalener: -2002.86399490 hartree
nucrepener: 1565.03987483 hartree
electener: -3567.90386973 hartree
oneelecener: -5872.83845566 hartree
twoeener: 2304.93458593 hartree
kineticenergy: 1997.89333023 hartree
xcener: -120.691886937891 hartree
chargesum: -0.0000000
charge: -0.168001 -0.125257 -0.420097 0.626736 -0.298743 -0.317177 -0.088330 -0.120775 0.005102 0.020436 -0.128510 -0.211161 -0.240676 -0.221660 0.120520 0.099265 0.046941 0.121364 0.072522 0.103527 0.095400 0.096729 0.086438 0.103699 0.084605 0.095223 0.062481 0.093069 0.077942 0.088813 0.062329 0.088437 0.088808
qa: -0.1680 -0.1253 -0.4201 0.6267 -0.2987 -0.3172 -0.0883 -0.1208 0.0051 0.0204 -0.1285 -0.2112 -0.2407 -0.2217 0.1205 0.0993 0.0469 0.1214 0.0725 0.1035 0.0954 0.0967 0.0864 0.1037 0.0846 0.0952 0.0625 0.0931 0.0779 0.0888 0.0623 0.0884 0.0888
va: 2.2903 2.2002 2.0137 5.4306 2.1471 2.1443 3.8442 3.9906 3.9171 3.8885 3.9686 3.8913 3.8936 3.9073 1.0202 1.0436 1.0419 1.0120 1.0064 0.9934 1.0105 0.9915 1.0146 1.0063 1.0105 1.0092 1.0272 1.0063 1.0124 1.0137 1.0037 1.0070 1.0166
dispcorr: -0.017044351 hartree
energy: -2002.881039250367
dipole: -5.61530 5.86269 0.24740 0.51880 -0.47456 0.04424 7.78227 -7.87810 -0.09584
magnitude: 0.26897 au
magnitude: 0.68368 debye
