program: Orca
programVersion: 5.0.4
elementType: S S S P O O C C C C C C C C H H H H H H H H H H H H H H H H H H H
charge: 0
multiplicity: 1
keywords: wb97x-d3
keywords: def2-TZVPP
keywords: def2/J RIJCOSX
keywords: DEFGRID2
keywords: scfconv7
keywords: smallprint printgap noloewdin
keywords: NOSOSCF
formula: C8H19O2PS3
InChI: InChI=1/C8H19O2PS3/c1-4-9-11(12,10-5-2)14-8-7-13-6-3/h4-8H2,1-3H3
33 atoms
S  -0.481835 0.449023 -1.550705
S  -3.097664 -1.07512 1.710672
S  1.22002 1.303372 1.269244
P  1.285666 0.448038 -0.455802
O  1.708552 -1.092877 -0.46918
O  2.317506 1.058343 -1.521653
C  -1.7254 0.368026 -0.213078
C  -1.763097 -0.979951 0.482335
C  2.746512 -1.582205 0.395463
C  2.487247 2.477741 -1.6424
C  -4.370407 -1.985122 0.791841
C  2.150881 -2.337117 1.56017
C  3.753738 2.921839 -0.949178
C  -4.956087 -1.250244 -0.399013
H  -2.671578 0.587643 -0.70684
H  -1.524516 1.170348 0.496434
H  -0.829774 -1.145392 1.020576
H  -1.867568 -1.79515 -0.235466
H  3.367438 -2.231406 -0.222205
H  3.374948 -0.763166 0.753568
H  2.526782 2.685435 -2.711934
H  1.621328 3.006534 -1.234998
H  -3.967943 -2.955287 0.493778
H  -5.146764 -2.184941 1.53255
H  1.560536 -1.674233 2.191815
H  1.517542 -3.156148 1.2198
H  2.948287 -2.761202 2.171474
H  3.900801 3.991626 -1.100567
H  3.695504 2.737993 0.122793
H  4.625249 2.403292 -1.348155
H  -4.213356 -1.094389 -1.181809
H  -5.770593 -1.82741 -0.839965
H  -5.349241 -0.277941 -0.104967
totalener: -2002.86441592 hartree
nucrepener: 1522.15779981 hartree
electener: -3525.02221573 hartree
oneelecener: -5787.34269348 hartree
twoeener: 2262.32047775 hartree
kineticenergy: 1997.89907951 hartree
xcener: -120.686223287884 hartree
chargesum: 0.0000000
charge: -0.146717 -0.117241 -0.409623 0.607108 -0.313007 -0.335473 -0.134250 -0.113585 0.041608 0.028344 -0.119961 -0.247574 -0.230506 -0.249600 0.113114 0.131271 0.097519 0.097280 0.093066 0.079181 0.096553 0.082248 0.085583 0.096712 0.086884 0.089959 0.088874 0.080610 0.085050 0.084014 0.070138 0.092658 0.089763
qa: -0.1467 -0.1172 -0.4096 0.6071 -0.3130 -0.3355 -0.1343 -0.1136 0.0416 0.0283 -0.1200 -0.2476 -0.2305 -0.2496 0.1131 0.1313 0.0975 0.0973 0.0931 0.0792 0.0966 0.0822 0.0856 0.0967 0.0869 0.0900 0.0889 0.0806 0.0851 0.0840 0.0701 0.0927 0.0898
va: 2.3051 2.1959 2.0186 5.4410 2.1037 2.1082 3.9030 3.9220 3.8874 3.8855 3.9853 3.9159 3.9307 3.8984 1.0138 1.0344 1.0366 1.0209 0.9959 1.0109 0.9936 1.0131 1.0091 1.0047 1.0155 1.0018 1.0146 1.0120 1.0217 1.0041 1.0021 1.0089 1.0123
dispcorr: -0.015110419 hartree
energy: -2002.879526337885
dipole: -3.47086 3.56868 0.09781 -5.45640 5.06371 -0.39269 0.60306 -1.29216 -0.68910
magnitude: 0.79915 au
magnitude: 2.03127 debye
