program: Orca
programVersion: 5.0.4
elementType: S S S P O O C C C C C C C C H H H H H H H H H H H H H H H H H H H
charge: 0
multiplicity: 1
keywords: wb97x-d3
keywords: def2-TZVPP
keywords: def2/J RIJCOSX
keywords: DEFGRID2
keywords: scfconv7
keywords: smallprint printgap noloewdin
keywords: NOSOSCF
formula: C8H19O2PS3
InChI: InChI=1/C8H19O2PS3/c1-4-9-11(12,10-5-2)14-8-7-13-6-3/h4-8H2,1-3H3
33 atoms
S  0.178224 -1.250262 -1.464163
S  -3.999867 -0.350394 -0.272848
S  0.451498 0.808505 1.257884
P  1.33748 -0.042522 -0.228907
O  2.551643 -1.013008 0.126623
O  2.055583 0.944375 -1.27134
C  -1.417562 -1.333492 -0.573457
C  -2.316058 -0.16124 -0.919059
C  3.550972 -0.609377 1.079935
C  1.358136 2.071931 -1.810181
C  -3.904107 0.486496 1.335789
C  3.377173 -1.366415 2.374228
C  1.79594 3.348549 -1.131053
C  -3.183438 -0.279495 2.429747
H  -1.229421 -1.404916 0.495457
H  -1.864457 -2.273606 -0.896903
H  -2.409663 -0.073183 -2.002426
H  -1.887933 0.771995 -0.54974
H  4.513229 -0.828801 0.616861
H  3.508313 0.467816 1.259522
H  1.593071 2.090788 -2.874766
H  0.275577 1.938373 -1.720172
H  -3.460836 1.473321 1.189833
H  -4.947419 0.650987 1.611737
H  4.176387 -1.099909 3.066578
H  2.425919 -1.119085 2.843725
H  3.417845 -2.443093 2.212138
H  1.304139 4.201927 -1.598965
H  1.530242 3.340059 -0.074997
H  2.872472 3.492249 -1.219719
H  -2.115742 -0.356942 2.228869
H  -3.293934 0.236146 3.38547
H  -3.589517 -1.284347 2.53847
totalener: -2002.86427542 hartree
nucrepener: 1536.32532347 hartree
electener: -3539.18959889 hartree
oneelecener: -5815.58221172 hartree
twoeener: 2276.39261283 hartree
kineticenergy: 1997.90732624 hartree
xcener: -120.688244001392 hartree
chargesum: -0.0000000
charge: -0.146931 -0.124669 -0.429366 0.637627 -0.318174 -0.321010 -0.085176 -0.156584 0.024326 0.030569 -0.117235 -0.221739 -0.228045 -0.238468 0.104735 0.120324 0.118130 0.081487 0.094692 0.077937 0.098353 0.070044 0.086153 0.100172 0.078456 0.083618 0.086806 0.079755 0.086653 0.085194 0.070266 0.086225 0.085875
qa: -0.1469 -0.1247 -0.4294 0.6376 -0.3182 -0.3210 -0.0852 -0.1566 0.0243 0.0306 -0.1172 -0.2217 -0.2280 -0.2385 0.1047 0.1203 0.1181 0.0815 0.0947 0.0779 0.0984 0.0700 0.0862 0.1002 0.0785 0.0836 0.0868 0.0798 0.0867 0.0852 0.0703 0.0862 0.0859
va: 2.3071 2.2037 1.9972 5.4107 2.1421 2.0984 3.8268 3.9820 3.9119 3.9206 3.9775 3.9277 3.9291 3.8797 1.0449 1.0225 1.0123 1.0397 0.9951 1.0076 0.9950 1.0001 1.0110 1.0024 1.0109 1.0196 1.0052 1.0121 1.0213 1.0049 1.0272 1.0098 1.0150
dispcorr: -0.015549821 hartree
energy: -2002.879825240757
dipole: -0.20265 0.84198 0.63933 6.99355 -6.52941 0.46414 9.86017 -9.78137 0.07880
magnitude: 0.79396 au
magnitude: 2.01809 debye
