program: Orca
programVersion: 5.0.4
elementType: S S S P O O C C C C C C C C H H H H H H H H H H H H H H H H H H H
charge: 0
multiplicity: 1
keywords: wb97x-d3
keywords: def2-TZVPP
keywords: def2/J RIJCOSX
keywords: DEFGRID2
keywords: scfconv7
keywords: smallprint printgap noloewdin
keywords: NOSOSCF
formula: C8H19O2PS3
InChI: InChI=1/C8H19O2PS3/c1-4-9-11(12,10-5-2)14-8-7-13-6-3/h4-8H2,1-3H3
33 atoms
S  0.310665 -0.681553 -1.727096
S  -3.229685 -1.976319 0.64683
S  -0.202353 1.797443 0.542714
P  1.063268 0.583301 -0.230717
O  1.767888 -0.33925 0.861905
O  2.333463 1.191586 -0.998832
C  -1.412156 -0.885334 -1.150647
C  -1.522538 -1.767644 0.077623
C  2.721046 -1.358909 0.529754
C  2.181496 2.298653 -1.899095
C  -3.499352 -0.441992 1.592198
C  2.232502 -2.695533 1.032411
C  2.590305 3.588297 -1.22711
C  -4.144453 0.685061 0.805815
H  -1.948262 -1.322849 -1.992787
H  -1.816708 0.109107 -0.972111
H  -0.923956 -1.374895 0.900924
H  -1.148973 -2.768729 -0.143307
H  2.898242 -1.403377 -0.547426
H  3.662081 -1.076876 1.003497
H  2.8182 2.07851 -2.756141
H  1.151776 2.359943 -2.261593
H  -4.134494 -0.727717 2.431853
H  -2.543112 -0.126205 2.013135
H  2.028104 -2.669031 2.102077
H  1.324301 -2.99969 0.513101
H  2.992427 -3.456422 0.852973
H  2.522643 4.410963 -1.939652
H  1.936694 3.813897 -0.385857
H  3.617627 3.538415 -0.867519
H  -3.490105 1.053837 0.018094
H  -5.078717 0.363744 0.347617
H  -4.363613 1.52645 1.465576
totalener: -2002.86458901 hartree
nucrepener: 1549.19091975 hartree
electener: -3552.05550876 hartree
oneelecener: -5841.25000308 hartree
twoeener: 2289.19449432 hartree
kineticenergy: 1997.89639196 hartree
xcener: -120.687456004941 hartree
chargesum: -0.0000000
charge: -0.187361 -0.126075 -0.392494 0.630614 -0.309062 -0.332810 -0.078554 -0.171840 0.008765 0.018270 -0.112330 -0.219357 -0.221191 -0.240115 0.119320 0.107587 0.098960 0.111316 0.080702 0.097434 0.096078 0.082197 0.104696 0.082735 0.095556 0.072000 0.086619 0.078785 0.088046 0.082881 0.075570 0.086413 0.086647
qa: -0.1874 -0.1261 -0.3925 0.6306 -0.3091 -0.3328 -0.0786 -0.1718 0.0088 0.0183 -0.1123 -0.2194 -0.2212 -0.2401 0.1193 0.1076 0.0990 0.1113 0.0807 0.0974 0.0961 0.0822 0.1047 0.0827 0.0956 0.0720 0.0866 0.0788 0.0880 0.0829 0.0756 0.0864 0.0866
va: 2.2765 2.1981 2.0604 5.4193 2.1194 2.0926 3.8176 4.0161 3.9297 3.8961 3.9406 3.9069 3.9327 3.9243 1.0164 1.0551 1.0291 1.0106 0.9998 0.9963 0.9934 1.0115 1.0036 1.0243 1.0055 1.0150 1.0138 1.0103 1.0211 1.0059 1.0102 1.0112 1.0066
dispcorr: -0.016302511 hartree
energy: -2002.880891520463
dipole: -0.50980 1.44107 0.93128 0.85408 -0.99057 -0.13648 1.83970 -2.38765 -0.54795
magnitude: 1.08911 au
magnitude: 2.76829 debye
