program: Orca
programVersion: 5.0.4
elementType: S S S P O O C C C C C C C C H H H H H H H H H H H H H H H H H H H
charge: 0
multiplicity: 1
keywords: wb97x-d3
keywords: def2-TZVPP
keywords: def2/J RIJCOSX
keywords: DEFGRID2
keywords: scfconv7
keywords: smallprint printgap noloewdin
keywords: NOSOSCF
formula: C8H19O2PS3
InChI: InChI=1/C8H19O2PS3/c1-4-9-11(12,10-5-2)14-8-7-13-6-3/h4-8H2,1-3H3
33 atoms
S  -0.033022 -1.371335 -0.860619
S  -3.743386 0.523018 0.680914
S  1.179574 0.595134 1.644079
P  1.332695 0.050538 -0.195489
O  2.71055 -0.64196 -0.638702
O  1.207851 1.213584 -1.285274
C  -1.491104 -1.000925 0.173475
C  -2.188262 0.288479 -0.217435
C  3.261343 -1.715367 0.137398
C  1.705116 2.534962 -1.031134
C  -4.833469 -0.59949 -0.241318
C  4.396643 -1.224801 1.004677
C  3.215828 2.601868 -0.997485
C  -6.236308 -0.524804 0.337277
H  -1.18648 -0.980776 1.219356
H  -2.140091 -1.865457 0.028043
H  -2.371023 0.330018 -1.292695
H  -1.560168 1.142411 0.039465
H  2.486282 -2.188708 0.74746
H  3.606221 -2.45803 -0.582982
H  1.307639 3.138895 -1.845948
H  1.282044 2.907345 -0.094918
H  -4.837978 -0.307752 -1.293433
H  -4.459643 -1.623273 -0.181611
H  5.172295 -0.747586 0.406004
H  4.03988 -0.514291 1.748657
H  4.847844 -2.067612 1.528852
H  3.622781 2.079109 -0.132612
H  3.65432 2.175512 -1.898807
H  3.527886 3.64434 -0.928665
H  -6.907359 -1.184692 -0.212513
H  -6.250658 -0.830061 1.383168
H  -6.63621 0.48695 0.275387
totalener: -2002.86573761 hartree
nucrepener: 1507.45564809 hartree
electener: -3510.32138570 hartree
oneelecener: -5757.92763790 hartree
twoeener: 2247.60625221 hartree
kineticenergy: 1997.89460721 hartree
xcener: -120.686673628746 hartree
chargesum: -0.0000000
charge: -0.151039 -0.107560 -0.403059 0.603206 -0.332819 -0.314869 -0.125547 -0.113267 0.030956 0.020161 -0.132664 -0.240016 -0.226070 -0.251166 0.124320 0.110897 0.096945 0.103142 0.082063 0.096451 0.097635 0.089193 0.086984 0.079602 0.084876 0.087988 0.085049 0.077278 0.090738 0.084814 0.084134 0.090433 0.091210
qa: -0.1510 -0.1076 -0.4031 0.6032 -0.3328 -0.3149 -0.1255 -0.1133 0.0310 0.0202 -0.1327 -0.2400 -0.2261 -0.2512 0.1243 0.1109 0.0969 0.1031 0.0821 0.0965 0.0976 0.0892 0.0870 0.0796 0.0849 0.0880 0.0850 0.0773 0.0907 0.0848 0.0841 0.0904 0.0912
va: 2.3088 2.2223 2.0325 5.4404 2.1024 2.1107 3.8838 3.9424 3.8877 3.8913 4.0246 3.9266 3.9046 3.9309 1.0402 1.0116 1.0227 1.0333 1.0124 0.9932 0.9901 1.0140 0.9980 0.9955 1.0028 1.0204 1.0133 1.0175 1.0072 1.0118 1.0033 1.0083 1.0093
dispcorr: -0.014389055 hartree
energy: -2002.880126664309
dipole: -3.18396 3.38033 0.19638 0.54091 -0.93101 -0.39010 -0.85466 0.16438 -0.69028
magnitude: 0.81684 au
magnitude: 2.07624 debye
