program: Orca
programVersion: 5.0.4
elementType: S S S P O O C C C C C C C C H H H H H H H H H H H H H H H H H H H
charge: 0
multiplicity: 1
keywords: wb97x-d3
keywords: def2-TZVPP
keywords: def2/J RIJCOSX
keywords: DEFGRID2
keywords: scfconv7
keywords: smallprint printgap noloewdin
keywords: NOSOSCF
formula: C8H19O2PS3
InChI: InChI=1/C8H19O2PS3/c1-4-9-11(12,10-5-2)14-8-7-13-6-3/h4-8H2,1-3H3
33 atoms
S  -0.061276 -1.403085 -0.553025
S  -3.800441 0.850432 0.321149
S  0.962694 1.132764 1.484572
P  1.263887 0.151574 -0.142833
O  2.671634 -0.608271 -0.271592
O  1.254678 1.004924 -1.494653
C  -1.574008 -0.814426 0.285142
C  -2.250304 0.323215 -0.453414
C  3.154525 -1.440542 0.788535
C  1.716889 2.362163 -1.533574
C  -4.904968 -0.546506 -0.065091
C  4.656897 -1.53603 0.678809
C  3.215623 2.48338 -1.373963
C  -5.113463 -1.502816 1.096165
H  -1.325021 -0.526849 1.306393
H  -2.210662 -1.698825 0.325944
H  -2.424235 0.065029 -1.499328
H  -1.611819 1.20774 -0.438648
H  2.866244 -1.017671 1.754703
H  2.690296 -2.426037 0.702219
H  1.399779 2.731398 -2.508169
H  1.200242 2.94341 -0.766004
H  -5.858121 -0.110591 -0.367082
H  -4.511625 -1.063236 -0.94294
H  4.963621 -1.958521 -0.277206
H  5.121723 -0.557109 0.789235
H  5.039732 -2.180584 1.469936
H  3.537182 2.20377 -0.371244
H  3.744841 1.862048 -2.095274
H  3.511725 3.520116 -1.537394
H  -5.822158 -2.287836 0.825905
H  -4.183122 -1.980367 1.400808
H  -5.509438 -0.979648 1.965382
totalener: -2002.86478586 hartree
nucrepener: 1509.69337291 hartree
electener: -3512.55815877 hartree
oneelecener: -5762.37294629 hartree
twoeener: 2249.81478752 hartree
kineticenergy: 1997.89634195 hartree
xcener: -120.685388062357 hartree
chargesum: 0.0000000
charge: -0.155717 -0.114375 -0.400482 0.607773 -0.328638 -0.314634 -0.122025 -0.128131 0.028198 0.024197 -0.130014 -0.230104 -0.229309 -0.228352 0.127530 0.109361 0.099564 0.098559 0.087703 0.086515 0.096459 0.089320 0.105750 0.078789 0.086407 0.082517 0.078775 0.078220 0.090825 0.084564 0.083942 0.069130 0.087681
qa: -0.1557 -0.1144 -0.4005 0.6078 -0.3286 -0.3146 -0.1220 -0.1281 0.0282 0.0242 -0.1300 -0.2301 -0.2293 -0.2284 0.1275 0.1094 0.0996 0.0986 0.0877 0.0865 0.0965 0.0893 0.1058 0.0788 0.0864 0.0825 0.0788 0.0782 0.0908 0.0846 0.0839 0.0691 0.0877
va: 2.3068 2.1922 2.0406 5.4336 2.1184 2.1114 3.8660 3.9714 3.8735 3.8867 3.9494 3.9572 3.9018 3.9344 1.0408 1.0116 1.0188 1.0341 1.0094 0.9964 0.9904 1.0138 1.0044 1.0110 1.0048 1.0075 1.0090 1.0217 1.0070 1.0113 1.0070 1.0106 1.0082
dispcorr: -0.014441656 hartree
energy: -2002.879227518085
dipole: -0.18796 0.47379 0.28583 -3.44778 2.82526 -0.62252 -0.19846 -0.29755 -0.49600
magnitude: 0.84572 au
magnitude: 2.14965 debye
