program: Orca
programVersion: 5.0.4
elementType: S S S P O O C C C C C C C C H H H H H H H H H H H H H H H H H H H
charge: 0
multiplicity: 1
keywords: wb97x-d3
keywords: def2-TZVPP
keywords: def2/J RIJCOSX
keywords: DEFGRID2
keywords: scfconv7
keywords: smallprint printgap noloewdin
keywords: NOSOSCF
formula: C8H19O2PS3
InChI: InChI=1/C8H19O2PS3/c1-4-9-11(12,10-5-2)14-8-7-13-6-3/h4-8H2,1-3H3
33 atoms
S  0.181894 -1.775105 -1.042103
S  -2.590602 0.436893 -0.718559
S  0.456032 0.271752 1.700262
P  1.010462 -0.108415 -0.107761
O  2.574707 -0.44829 -0.27889
O  0.860177 1.042456 -1.196644
C  -1.396003 -2.041187 -0.183879
C  -2.576623 -1.362811 -0.857283
C  3.213828 -1.386056 0.593645
C  1.302356 2.378949 -0.914524
C  -3.156025 0.608478 0.997504
C  4.065523 -0.673716 1.617859
C  0.133059 3.271652 -0.577746
C  -3.324807 2.078909 1.33216
H  -1.282536 -1.740476 0.858883
H  -1.533221 -3.12461 -0.196063
H  -3.507515 -1.75996 -0.442642
H  -2.58353 -1.592358 -1.923462
H  2.474521 -2.023074 1.087145
H  3.820948 -2.02838 -0.045164
H  2.036061 2.385699 -0.104234
H  1.810647 2.717009 -1.817609
H  -4.104388 0.079038 1.111792
H  -2.422258 0.160114 1.668436
H  4.601703 -1.405425 2.223122
H  4.803469 -0.030339 1.139448
H  3.450952 -0.068352 2.282406
H  -0.626918 3.237919 -1.356703
H  -0.323323 2.969996 0.36312
H  0.476567 4.301975 -0.477626
H  -4.043011 2.562051 0.670078
H  -3.681985 2.191176 2.355777
H  -2.376708 2.609117 1.253994
totalener: -2002.86289582 hartree
nucrepener: 1595.57747571 hartree
electener: -3598.44037153 hartree
oneelecener: -5934.72510950 hartree
twoeener: 2336.28473797 hartree
kineticenergy: 1997.91688539 hartree
xcener: -120.695382651080 hartree
chargesum: -0.0000000
charge: -0.140296 -0.098679 -0.426491 0.644295 -0.341011 -0.298343 -0.131711 -0.128272 0.030123 0.031776 -0.144938 -0.231317 -0.241389 -0.260713 0.111710 0.116037 0.093198 0.108152 0.074609 0.095186 0.078895 0.094402 0.092594 0.094681 0.079133 0.082962 0.085763 0.095082 0.071635 0.088664 0.092202 0.086839 0.095222
qa: -0.1403 -0.0987 -0.4265 0.6443 -0.3410 -0.2983 -0.1317 -0.1283 0.0301 0.0318 -0.1449 -0.2313 -0.2414 -0.2607 0.1117 0.1160 0.0932 0.1082 0.0746 0.0952 0.0789 0.0944 0.0926 0.0947 0.0791 0.0830 0.0858 0.0951 0.0716 0.0887 0.0922 0.0868 0.0952
va: 2.3046 2.2303 2.0036 5.4302 2.1044 2.1256 3.8650 3.9685 3.8966 3.9131 3.9940 3.9332 3.9137 3.9397 1.0402 1.0100 1.0136 1.0143 1.0156 0.9936 1.0055 0.9956 1.0025 1.0057 1.0117 1.0044 1.0211 1.0026 1.0184 1.0160 1.0088 1.0047 1.0053
dispcorr: -0.016566985 hartree
energy: -2002.879462801348
dipole: -3.60343 3.61634 0.01291 8.01023 -8.36311 -0.35288 7.94895 -7.75164 0.19731
magnitude: 0.40451 au
magnitude: 1.02817 debye
