program: Orca
programVersion: 5.0.4
elementType: S S S P O O C C C C C C C C H H H H H H H H H H H H H H H H H H H
charge: 0
multiplicity: 1
keywords: wb97x-d3
keywords: def2-TZVPP
keywords: def2/J RIJCOSX
keywords: DEFGRID2
keywords: scfconv7
keywords: smallprint printgap noloewdin
keywords: NOSOSCF
formula: C8H19O2PS3
InChI: InChI=1/C8H19O2PS3/c1-4-9-11(12,10-5-2)14-8-7-13-6-3/h4-8H2,1-3H3
33 atoms
S  0.299464 -1.027049 -1.512128
S  -3.874425 -0.379256 -0.162679
S  0.399668 0.670587 1.458013
P  1.395466 -0.16483 0.035817
O  2.38272 -1.342229 0.46724
O  2.400936 0.780564 -0.782569
C  -1.328152 -1.291802 -0.716512
C  -2.252581 -0.107758 -0.921716
C  3.016709 -1.371345 1.752476
C  1.953399 2.035159 -1.302728
C  -3.495012 -0.01092 1.576018
C  4.099418 -0.326475 1.8954
C  3.097391 2.663066 -2.061389
C  -4.752155 -0.187663 2.409219
H  -1.174018 -1.502658 0.340424
H  -1.736168 -2.190314 -1.17829
H  -2.428712 0.056509 -1.985634
H  -1.806084 0.801204 -0.51659
H  2.261144 -1.254343 2.533015
H  3.431296 -2.375581 1.831405
H  1.093388 1.87496 -1.960071
H  1.62748 2.67428 -0.478357
H  -2.703666 -0.669487 1.93534
H  -3.124138 1.012251 1.6482
H  3.685403 0.68125 1.90216
H  4.621212 -0.47496 2.841247
H  4.829929 -0.397709 1.090741
H  3.415525 2.035067 -2.892512
H  2.783717 3.624902 -2.466417
H  3.954887 2.835602 -1.41194
H  -4.546017 0.043609 3.454155
H  -5.549492 0.473927 2.071698
H  -5.121008 -1.211959 2.360608
totalener: -2002.86694957 hartree
nucrepener: 1517.92118394 hartree
electener: -3520.78813351 hartree
oneelecener: -5778.81186474 hartree
twoeener: 2258.02373123 hartree
kineticenergy: 1997.90359589 hartree
xcener: -120.688348856114 hartree
chargesum: -0.0000000
charge: -0.153344 -0.123521 -0.426800 0.629133 -0.314940 -0.316856 -0.088399 -0.137515 0.013080 0.026467 -0.113239 -0.226803 -0.230236 -0.254538 0.096455 0.119693 0.112704 0.092976 0.089280 0.096590 0.081786 0.096368 0.079659 0.088888 0.079582 0.083194 0.090551 0.086420 0.076229 0.084566 0.085422 0.089525 0.087623
qa: -0.1533 -0.1235 -0.4268 0.6291 -0.3149 -0.3169 -0.0884 -0.1375 0.0131 0.0265 -0.1132 -0.2268 -0.2302 -0.2545 0.0965 0.1197 0.1127 0.0930 0.0893 0.0966 0.0818 0.0964 0.0797 0.0889 0.0796 0.0832 0.0906 0.0864 0.0762 0.0846 0.0854 0.0895 0.0876
va: 2.2997 2.2151 2.0118 5.4174 2.1468 2.1135 3.8275 3.9783 3.9069 3.8621 4.0071 3.8896 3.9691 3.9407 1.0458 1.0230 1.0135 1.0386 1.0125 0.9903 1.0012 1.0043 1.0032 1.0004 1.0222 1.0118 1.0069 1.0057 1.0081 1.0057 1.0029 1.0085 1.0085
dispcorr: -0.014387091 hartree
energy: -2002.881336656684
dipole: 0.64061 0.13628 0.77689 6.73079 -6.49516 0.23563 6.68595 -6.54869 0.13726
magnitude: 0.82335 au
magnitude: 2.09280 debye
