program: Orca
programVersion: 5.0.4
elementType: S S S P O O C C C C C C C C H H H H H H H H H H H H H H H H H H H
charge: 0
multiplicity: 1
keywords: wb97x-d3
keywords: def2-TZVPP
keywords: def2/J RIJCOSX
keywords: DEFGRID2
keywords: scfconv7
keywords: smallprint printgap noloewdin
keywords: NOSOSCF
formula: C8H19O2PS3
InChI: InChI=1/C8H19O2PS3/c1-4-9-11(12,10-5-2)14-8-7-13-6-3/h4-8H2,1-3H3
33 atoms
S  -0.009645 -1.299474 -1.393005
S  -2.85142 0.55072 -0.696827
S  0.249498 -0.061988 1.819545
P  1.065897 -0.289238 0.087325
O  2.439663 -1.105072 0.066872
O  1.515805 1.053307 -0.663066
C  -1.491809 -1.900163 -0.528478
C  -2.757796 -1.221238 -1.028218
C  3.37603 -1.053506 1.149533
C  0.579304 2.106258 -0.914113
C  -3.30035 0.541753 1.061553
C  4.088714 0.276169 1.253279
C  1.345637 3.313779 -1.396152
C  -3.183337 1.950216 1.615564
H  -1.354484 -1.75948 0.544547
H  -1.546081 -2.974036 -0.715209
H  -3.627672 -1.71743 -0.58892
H  -2.848993 -1.336317 -2.10925
H  2.862529 -1.290756 2.084418
H  4.081901 -1.856431 0.939703
H  -0.146941 1.772073 -1.658141
H  0.025836 2.332127 0.001115
H  -4.31865 0.163611 1.17093
H  -2.623691 -0.118861 1.604141
H  4.554926 0.552493 0.308507
H  3.409646 1.074077 1.551551
H  4.87056 0.207379 2.010323
H  2.049577 3.66587 -0.642752
H  1.897651 3.098249 -2.310455
H  0.647883 4.123571 -1.609528
H  -2.151021 2.295623 1.570544
H  -3.809437 2.654298 1.067194
H  -3.495973 1.970007 2.659519
totalener: -2002.86425910 hartree
nucrepener: 1579.49622604 hartree
electener: -3582.36048514 hartree
oneelecener: -5902.40777156 hartree
twoeener: 2320.04728642 hartree
kineticenergy: 1997.90561993 hartree
xcener: -120.693237545777 hartree
chargesum: -0.0000000
charge: -0.143147 -0.110914 -0.423962 0.643165 -0.317501 -0.311495 -0.118806 -0.139424 0.008572 0.051108 -0.147689 -0.224473 -0.240072 -0.247919 0.102079 0.116056 0.096383 0.109847 0.090054 0.094802 0.086085 0.072931 0.098198 0.096311 0.089457 0.079519 0.082709 0.082225 0.086372 0.078122 0.083132 0.091711 0.086565
qa: -0.1431 -0.1109 -0.4240 0.6432 -0.3175 -0.3115 -0.1188 -0.1394 0.0086 0.0511 -0.1477 -0.2245 -0.2401 -0.2479 0.1021 0.1161 0.0964 0.1098 0.0901 0.0948 0.0861 0.0729 0.0982 0.0963 0.0895 0.0795 0.0827 0.0822 0.0864 0.0781 0.0831 0.0917 0.0866
va: 2.2966 2.2094 2.0230 5.4116 2.1494 2.1225 3.8612 3.9841 3.9159 3.8778 3.9986 3.8873 3.9763 3.9341 1.0539 1.0130 1.0112 1.0083 1.0107 0.9900 1.0024 0.9999 1.0042 1.0025 1.0073 1.0217 1.0115 1.0068 1.0061 1.0074 1.0162 1.0049 1.0054
dispcorr: -0.016100788 hartree
energy: -2002.880359885818
dipole: -1.93289 1.86698 -0.06591 10.78140 -10.90146 -0.12006 5.12862 -5.03730 0.09132
magnitude: 0.16461 au
magnitude: 0.41841 debye
