program: Orca
programVersion: 5.0.4
elementType: S S S P O O C C C C C C C C H H H H H H H H H H H H H H H H H H H
charge: 0
multiplicity: 1
keywords: wb97x-d3
keywords: def2-TZVPP
keywords: def2/J RIJCOSX
keywords: DEFGRID2
keywords: scfconv7
keywords: smallprint printgap noloewdin
keywords: NOSOSCF
formula: C8H19O2PS3
InChI: InChI=1/C8H19O2PS3/c1-4-9-11(12,10-5-2)14-8-7-13-6-3/h4-8H2,1-3H3
33 atoms
S  -0.34785 0.417541 -1.3173
S  -3.468169 -1.102373 1.462485
S  1.095593 0.824378 1.753548
P  1.293832 0.197441 -0.053614
O  1.673538 -1.345888 -0.227717
O  2.442332 0.898007 -0.930454
C  -1.730761 0.359007 -0.125108
C  -1.992265 -1.038208 0.406304
C  2.5099 -2.02206 0.721515
C  2.535016 2.325262 -0.988055
C  -4.724103 -1.709089 0.301814
C  3.949149 -1.560086 0.677492
C  3.693212 2.68802 -1.885616
C  -5.037147 -0.781459 -0.857713
H  -2.585836 0.741679 -0.681623
H  -1.522372 1.055649 0.686638
H  -1.150938 -1.361344 1.020224
H  -2.093977 -1.759372 -0.406318
H  2.095824 -1.894055 1.724522
H  2.431302 -3.075092 0.454251
H  1.599627 2.738008 -1.3780
H  2.677576 2.721441 0.020394
H  -4.429807 -2.697095 -0.057755
H  -5.611805 -1.854254 0.92016
H  4.054454 -0.536913 1.036678
H  4.551917 -2.199179 1.323341
H  4.355758 -1.618011 -0.331342
H  3.782345 3.772712 -1.943781
H  4.632993 2.293976 -1.500379
H  3.548108 2.307896 -2.896249
H  -4.189382 -0.683736 -1.535938
H  -5.871776 -1.171833 -1.442385
H  -5.306625 0.212757 -0.503445
totalener: -2002.86568956 hartree
nucrepener: 1510.71570829 hartree
electener: -3513.58139785 hartree
oneelecener: -5764.44845043 hartree
twoeener: 2250.86705258 hartree
kineticenergy: 1997.89808582 hartree
xcener: -120.685924809766 hartree
chargesum: 0.0000000
charge: -0.155730 -0.115389 -0.402351 0.609532 -0.315855 -0.328549 -0.133820 -0.128555 0.018118 0.025873 -0.120573 -0.228562 -0.230491 -0.251797 0.115422 0.130813 0.112511 0.095672 0.090633 0.096643 0.084616 0.095652 0.085721 0.097181 0.080139 0.083657 0.090235 0.076931 0.083472 0.085704 0.070065 0.093811 0.089271
qa: -0.1557 -0.1154 -0.4024 0.6095 -0.3159 -0.3285 -0.1338 -0.1286 0.0181 0.0259 -0.1206 -0.2286 -0.2305 -0.2518 0.1154 0.1308 0.1125 0.0957 0.0906 0.0966 0.0846 0.0957 0.0857 0.0972 0.0801 0.0837 0.0902 0.0769 0.0835 0.0857 0.0701 0.0938 0.0893
va: 2.2971 2.1983 2.0397 5.4310 2.1118 2.1165 3.8913 3.9161 3.8954 3.8605 3.9874 3.8982 3.9634 3.8987 1.0123 1.0389 1.0341 1.0206 1.0129 0.9900 1.0017 1.0068 1.0089 1.0040 1.0225 1.0114 1.0071 1.0080 1.0056 1.0055 1.0014 1.0088 1.0121
dispcorr: -0.014470004 hartree
energy: -2002.880159560646
dipole: -0.73060 0.87380 0.14320 -1.74788 1.53817 -0.20971 -6.04510 5.15903 -0.88607
magnitude: 0.92174 au
magnitude: 2.34287 debye
