program: Orca
programVersion: 5.0.4
elementType: S S S P O O C C C C C C C C H H H H H H H H H H H H H H H H H H H
charge: 0
multiplicity: 1
keywords: wb97x-d3
keywords: def2-TZVPP
keywords: def2/J RIJCOSX
keywords: DEFGRID2
keywords: scfconv7
keywords: smallprint printgap noloewdin
keywords: NOSOSCF
formula: C8H19O2PS3
InChI: InChI=1/C8H19O2PS3/c1-4-9-11(12,10-5-2)14-8-7-13-6-3/h4-8H2,1-3H3
33 atoms
S  -0.063319 -1.483939 -0.608341
S  -3.44329 -0.731239 -0.528156
S  1.317741 0.068449 2.115573
P  1.158615 -0.004864 0.198014
O  2.525102 -0.206458 -0.618981
O  0.581826 1.315388 -0.506821
C  -1.210315 -1.78376 0.773431
C  -2.321733 -0.759979 0.897638
C  3.643585 -0.912525 -0.070086
C  1.177534 2.591525 -0.232852
C  -2.894065 0.753111 -1.419527
C  3.42324 -2.407086 -0.001934
C  0.256722 3.667035 -0.754389
C  -3.328961 2.048006 -0.759864
H  -0.628982 -1.842023 1.695318
H  -1.620387 -2.773565 0.570663
H  -1.913337 0.235728 1.07752
H  -2.921693 -1.009696 1.775469
H  4.475538 -0.672791 -0.731788
H  3.873038 -0.513977 0.921006
H  1.332358 2.701446 0.84386
H  2.153596 2.644775 -0.721226
H  -1.814245 0.711629 -1.553969
H  -3.341534 0.659311 -2.410437
H  4.345361 -2.891057 0.321402
H  2.644497 -2.665613 0.714768
H  3.147281 -2.817085 -0.972607
H  0.698364 4.646191 -0.569208
H  0.095386 3.568624 -1.827367
H  -0.711009 3.635291 -0.255141
H  -4.412394 2.095382 -0.660513
H  -2.89935 2.154679 0.236997
H  -3.00128 2.906412 -1.349371
totalener: -2002.86488144 hartree
nucrepener: 1570.26591435 hartree
electener: -3573.13079579 hartree
oneelecener: -5883.58682307 hartree
twoeener: 2310.45602728 hartree
kineticenergy: 1997.90771108 hartree
xcener: -120.690129211505 hartree
chargesum: 0.0000000
charge: -0.129163 -0.133436 -0.410330 0.619499 -0.343300 -0.312314 -0.130902 -0.123403 0.020891 0.010751 -0.089285 -0.237466 -0.244492 -0.274414 0.123903 0.118118 0.079689 0.115063 0.094255 0.092215 0.090919 0.097803 0.087202 0.099398 0.087210 0.082620 0.091429 0.091053 0.090251 0.079919 0.098008 0.074509 0.083798
qa: -0.1292 -0.1334 -0.4103 0.6195 -0.3433 -0.3123 -0.1309 -0.1234 0.0209 0.0108 -0.0893 -0.2375 -0.2445 -0.2744 0.1239 0.1181 0.0797 0.1151 0.0943 0.0922 0.0909 0.0978 0.0872 0.0994 0.0872 0.0826 0.0914 0.0911 0.0903 0.0799 0.0980 0.0745 0.0838
va: 2.3084 2.1673 2.0340 5.4047 2.1074 2.1200 3.9010 3.9436 3.8951 3.8844 3.9127 3.8986 3.9444 3.9319 1.0387 1.0120 1.0306 1.0094 0.9904 1.0138 1.0072 0.9939 1.0401 1.0075 1.0136 1.0178 1.0054 1.0108 1.0037 1.0050 1.0186 1.0019 1.0023
dispcorr: -0.016539605 hartree
energy: -2002.881421043066
dipole: -1.38494 2.09836 0.71342 10.31238 -9.82126 0.49112 -2.80012 2.55414 -0.24598
magnitude: 0.90037 au
magnitude: 2.28856 debye
