program: Orca
programVersion: 5.0.4
elementType: S S S P O O C C C C C C C C H H H H H H H H H H H H H H H H H H H
charge: 0
multiplicity: 1
keywords: wb97x-d3
keywords: def2-TZVPP
keywords: def2/J RIJCOSX
keywords: DEFGRID2
keywords: scfconv7
keywords: smallprint printgap noloewdin
keywords: NOSOSCF
formula: C8H19O2PS3
InChI: InChI=1/C8H19O2PS3/c1-4-9-11(12,10-5-2)14-8-7-13-6-3/h4-8H2,1-3H3
33 atoms
S  0.059498 -1.26418 -1.23803
S  -2.65135 0.880459 -0.732739
S  0.304573 -0.004968 1.952759
P  1.140947 -0.248277 0.233032
O  2.484771 -1.115776 0.212557
O  1.667669 1.085103 -0.480963
C  -1.51599 -1.67656 -0.429229
C  -2.688026 -0.904009 -1.012244
C  3.610001 -0.719643 1.008547
C  0.854138 2.25627 -0.628984
C  -3.161866 0.987603 1.006171
C  4.489468 -1.927178 1.221516
C  0.488761 2.461273 -2.079775
C  -4.636991 0.713835 1.232565
H  -1.411223 -1.512352 0.644472
H  -1.665853 -2.746542 -0.583617
H  -3.619128 -1.317523 -0.616984
H  -2.730099 -1.035268 -2.094473
H  4.151996 0.072967 0.487982
H  3.26652 -0.321266 1.967513
H  -0.04283 2.178143 -0.010802
H  1.446971 3.090048 -0.25008
H  -2.526069 0.337218 1.607845
H  -2.911396 2.006797 1.304974
H  5.366264 -1.641621 1.802965
H  3.961737 -2.707887 1.76763
H  4.834606 -2.340821 0.274564
H  -0.127585 1.642241 -2.446287
H  -0.08403 3.383061 -2.184648
H  1.376356 2.541797 -2.706982
H  -4.912749 -0.301345 0.945913
H  -4.886265 0.82837 2.288754
H  -5.258158 1.400907 0.659947
totalener: -2002.86407143 hartree
nucrepener: 1567.57207418 hartree
electener: -3570.43614560 hartree
oneelecener: -5878.54628578 hartree
twoeener: 2308.11014017 hartree
kineticenergy: 1997.90001206 hartree
xcener: -120.691640109998 hartree
chargesum: -0.0000000
charge: -0.138187 -0.122776 -0.417100 0.638209 -0.313747 -0.322214 -0.123562 -0.151644 0.021271 0.034573 -0.111967 -0.225995 -0.220849 -0.239728 0.107224 0.117055 0.099303 0.111412 0.094027 0.082752 0.067695 0.093822 0.090018 0.099951 0.073493 0.085761 0.085015 0.068997 0.082090 0.090503 0.070846 0.087511 0.086240
qa: -0.1382 -0.1228 -0.4171 0.6382 -0.3137 -0.3222 -0.1236 -0.1516 0.0213 0.0346 -0.1120 -0.2260 -0.2208 -0.2397 0.1072 0.1171 0.0993 0.1114 0.0940 0.0828 0.0677 0.0938 0.0900 0.1000 0.0735 0.0858 0.0850 0.0690 0.0821 0.0905 0.0708 0.0875 0.0862
va: 2.3017 2.1944 2.0346 5.4332 2.1538 2.1070 3.8529 3.9845 3.8847 3.8979 3.9404 3.9541 3.9119 3.9479 1.0539 1.0126 1.0101 1.0080 0.9954 1.0081 1.0194 0.9960 1.0276 1.0049 1.0085 1.0080 1.0056 1.0298 1.0107 1.0080 1.0057 1.0056 1.0121
dispcorr: -0.015994666 hartree
energy: -2002.880066091588
dipole: -5.80617 5.66817 -0.13799 3.73845 -3.74785 -0.00940 1.91348 -1.95883 -0.04535
magnitude: 0.14556 au
magnitude: 0.36998 debye
