program: Orca
programVersion: 5.0.4
elementType: S S S P O O C C C C C C C C H H H H H H H H H H H H H H H H H H H
charge: 0
multiplicity: 1
keywords: wb97x-d3
keywords: def2-TZVPP
keywords: def2/J RIJCOSX
keywords: DEFGRID2
keywords: scfconv7
keywords: smallprint printgap noloewdin
keywords: NOSOSCF
formula: C8H19O2PS3
InChI: InChI=1/C8H19O2PS3/c1-4-9-11(12,10-5-2)14-8-7-13-6-3/h4-8H2,1-3H3
33 atoms
S  0.437788 -1.486692 -1.186642
S  -3.82087 -1.025727 -0.034443
S  0.351567 0.997966 1.196518
P  1.197967 0.26724 -0.376883
O  2.744667 -0.126601 -0.225876
O  1.204287 1.234212 -1.651075
C  -1.346886 -1.068292 -1.237313
C  -2.077307 -1.517513 0.013262
C  3.30842 -0.555676 1.019802
C  1.276118 2.659876 -1.52109
C  -3.684047 0.69958 0.523678
C  2.881641 -1.95343 1.406453
C  2.622906 3.138178 -1.02814
C  -3.51039 0.839244 2.023809
H  -1.742027 -1.568533 -2.12093
H  -1.453436 0.002901 -1.405859
H  -1.599463 -1.116152 0.906992
H  -2.057575 -2.604817 0.094988
H  4.385845 -0.506706 0.866348
H  3.043764 0.15784 1.803665
H  1.071991 3.036915 -2.522632
H  0.478663 3.004604 -0.858407
H  -2.86514 1.188732 -0.007491
H  -4.60519 1.18153 0.192519
H  3.095072 -2.671473 0.615242
H  3.427445 -2.262541 2.298397
H  1.817611 -1.999993 1.636473
H  2.794176 2.851451 0.009126
H  3.434005 2.742701 -1.638218
H  2.660587 4.226679 -1.078751
H  -4.337095 0.374674 2.559315
H  -2.582884 0.378303 2.361495
H  -3.468765 1.892889 2.305368
totalener: -2002.86566658 hartree
nucrepener: 1551.67753101 hartree
electener: -3554.54319759 hartree
oneelecener: -5846.33074181 hartree
twoeener: 2291.78754422 hartree
kineticenergy: 1997.89945774 hartree
xcener: -120.689661757112 hartree
chargesum: 0.0000000
charge: -0.142310 -0.128693 -0.425734 0.625272 -0.333367 -0.320004 -0.099123 -0.142862 0.031733 0.017285 -0.113163 -0.246013 -0.230834 -0.235085 0.122365 0.094954 0.093922 0.113021 0.097131 0.090056 0.097976 0.089025 0.074613 0.101315 0.092370 0.087497 0.084772 0.078663 0.092804 0.084585 0.087548 0.075647 0.084634
qa: -0.1423 -0.1287 -0.4257 0.6253 -0.3334 -0.3200 -0.0991 -0.1429 0.0317 0.0173 -0.1132 -0.2460 -0.2308 -0.2351 0.1224 0.0950 0.0939 0.1130 0.0971 0.0901 0.0980 0.0890 0.0746 0.1013 0.0924 0.0875 0.0848 0.0787 0.0928 0.0846 0.0875 0.0756 0.0846
va: 2.2909 2.1884 2.0054 5.4235 2.1085 2.1262 3.8715 3.9662 3.8689 3.8934 3.9543 3.9116 3.9002 3.9114 1.0191 1.0323 1.0380 1.0159 0.9900 1.0126 0.9904 1.0143 1.0240 1.0063 1.0030 1.0146 1.0179 1.0200 1.0068 1.0116 1.0150 1.0091 1.0059
dispcorr: -0.016060094 hartree
energy: -2002.881726672676
dipole: 0.58878 0.20787 0.79665 6.83275 -6.33753 0.49522 7.30863 -7.36268 -0.05405
magnitude: 0.93958 au
magnitude: 2.38823 debye
