program: Orca
programVersion: 5.0.4
elementType: S S S P O O C C C C C C C C H H H H H H H H H H H H H H H H H H H
charge: 0
multiplicity: 1
keywords: wb97x-d3
keywords: def2-TZVPP
keywords: def2/J RIJCOSX
keywords: DEFGRID2
keywords: scfconv7
keywords: smallprint printgap noloewdin
keywords: NOSOSCF
formula: C8H19O2PS3
InChI: InChI=1/C8H19O2PS3/c1-4-9-11(12,10-5-2)14-8-7-13-6-3/h4-8H2,1-3H3
33 atoms
S  0.387015 -0.982705 -1.617903
S  -3.761935 -0.458177 -0.140744
S  0.572354 0.819793 1.291573
P  1.523047 -0.043481 -0.148145
O  2.524635 -1.21387 0.272548
O  2.494261 0.900429 -1.007918
C  -1.188241 -1.284754 -0.73126
C  -2.176367 -0.157692 -0.962428
C  3.357892 -1.09835 1.436642
C  2.228984 2.290698 -1.219103
C  -3.356887 0.050896 1.556032
C  2.82896 -1.97828 2.54462
C  1.089694 2.53995 -2.181923
C  -4.586643 -0.113004 2.431864
H  -0.97991 -1.426285 0.32796
H  -1.5707 -2.226431 -1.123776
H  -2.390194 -0.054307 -2.027049
H  -1.761473 0.790195 -0.61637
H  4.355428 -1.408545 1.124553
H  3.421436 -0.060096 1.771544
H  2.031104 2.772043 -0.258333
H  3.161667 2.693253 -1.613023
H  -2.530304 -0.547464 1.941126
H  -3.027879 1.091015 1.544315
H  3.504446 -1.942859 3.399868
H  1.848035 -1.638647 2.874857
H  2.749751 -3.015964 2.221855
H  1.026005 3.607737 -2.392882
H  1.238893 2.01575 -3.125032
H  0.133196 2.227624 -1.764445
H  -5.417796 0.490026 2.067022
H  -4.914333 -1.15175 2.467713
H  -4.36685 0.202853 3.451666
totalener: -2002.86479024 hartree
nucrepener: 1530.47100433 hartree
electener: -3533.33579457 hartree
oneelecener: -5803.94043770 hartree
twoeener: 2270.60464313 hartree
kineticenergy: 1997.89490470 hartree
xcener: -120.687422466616 hartree
chargesum: 0.0000000
charge: -0.143832 -0.125217 -0.433229 0.629890 -0.314291 -0.328848 -0.082473 -0.133192 0.029911 0.022590 -0.113523 -0.225135 -0.238984 -0.254930 0.093797 0.118814 0.118442 0.084269 0.094025 0.076847 0.092236 0.094887 0.079938 0.088896 0.079407 0.081363 0.087170 0.088485 0.092791 0.076697 0.089687 0.088001 0.085512
qa: -0.1438 -0.1252 -0.4332 0.6299 -0.3143 -0.3288 -0.0825 -0.1332 0.0299 0.0226 -0.1135 -0.2251 -0.2390 -0.2549 0.0938 0.1188 0.1184 0.0843 0.0940 0.0768 0.0922 0.0949 0.0799 0.0889 0.0794 0.0814 0.0872 0.0885 0.0928 0.0767 0.0897 0.0880 0.0855
va: 2.2927 2.2175 1.9974 5.4156 2.1336 2.1170 3.8278 3.9938 3.8987 3.8926 4.0081 3.9288 3.9081 3.9411 1.0468 1.0235 1.0104 1.0365 0.9950 1.0116 1.0114 0.9909 1.0024 1.0000 1.0115 1.0193 1.0048 1.0155 1.0054 1.0083 1.0086 1.0083 1.0029
dispcorr: -0.015058142 hartree
energy: -2002.879848377991
dipole: -5.24508 5.97092 0.72583 3.60246 -3.30420 0.29826 8.93823 -8.73047 0.20776
magnitude: 0.81176 au
magnitude: 2.06333 debye
