program: Orca
programVersion: 5.0.4
elementType: S S S P O O C C C C C C C C H H H H H H H H H H H H H H H H H H H
charge: 0
multiplicity: 1
keywords: wb97x-d3
keywords: def2-TZVPP
keywords: def2/J RIJCOSX
keywords: DEFGRID2
keywords: scfconv7
keywords: smallprint printgap noloewdin
keywords: NOSOSCF
formula: C8H19O2PS3
InChI: InChI=1/C8H19O2PS3/c1-4-9-11(12,10-5-2)14-8-7-13-6-3/h4-8H2,1-3H3
33 atoms
S  0.449217 -1.234822 -1.374689
S  -3.78818 -0.110461 -0.594142
S  0.338179 -0.292313 1.92336
P  1.190519 -0.096378 0.214093
O  2.726179 -0.54562 0.080953
O  1.164387 1.443464 -0.244775
C  -1.316723 -1.302592 -0.898489
C  -2.051683 0.009268 -1.093818
C  3.654785 -0.281414 1.148027
C  1.741322 1.886271 -1.480535
C  -3.642936 0.006404 1.214279
C  3.917014 -1.538275 1.941989
C  0.675884 2.473796 -2.375312
C  -3.245408 1.381149 1.717313
H  -1.365037 -1.645759 0.134605
H  -1.743951 -2.081566 -1.530176
H  -2.053985 0.289734 -2.148039
H  -1.569561 0.821983 -0.550402
H  4.563913 0.082975 0.669211
H  3.281258 0.512493 1.799777
H  2.491586 2.635653 -1.222987
H  2.259894 1.07244 -1.993785
H  -4.632639 -0.268598 1.582667
H  -2.95022 -0.753532 1.579385
H  4.665659 -1.33879 2.709201
H  3.008772 -1.881034 2.43557
H  4.291793 -2.337929 1.304015
H  0.129496 3.271365 -1.873375
H  1.137779 2.892758 -3.269711
H  -0.03444 1.711052 -2.691393
H  -3.260934 1.400883 2.808099
H  -2.232553 1.642388 1.41303
H  -3.926832 2.147892 1.350974
totalener: -2002.86439162 hartree
nucrepener: 1555.20051485 hartree
electener: -3558.06490647 hartree
oneelecener: -5853.31689207 hartree
twoeener: 2295.25198560 hartree
kineticenergy: 1997.88169199 hartree
xcener: -120.684780728224 hartree
chargesum: -0.0000000
charge: -0.154119 -0.123462 -0.395096 0.624610 -0.339489 -0.307259 -0.102175 -0.169326 0.005958 0.004937 -0.122078 -0.213783 -0.224591 -0.234770 0.116385 0.122216 0.114706 0.093329 0.093168 0.089532 0.094856 0.083086 0.102918 0.086155 0.078124 0.086846 0.085110 0.096231 0.089040 0.071926 0.087011 0.074343 0.085660
qa: -0.1541 -0.1235 -0.3951 0.6246 -0.3395 -0.3073 -0.1022 -0.1693 0.0060 0.0049 -0.1221 -0.2138 -0.2246 -0.2348 0.1164 0.1222 0.1147 0.0933 0.0932 0.0895 0.0949 0.0831 0.1029 0.0862 0.0781 0.0868 0.0851 0.0962 0.0890 0.0719 0.0870 0.0743 0.0857
va: 2.2884 2.2026 2.0584 5.3996 2.0954 2.0778 3.8470 3.9965 3.9146 3.9311 3.9707 3.9284 3.9150 3.8956 1.0384 1.0170 1.0101 1.0253 0.9930 1.0052 0.9942 0.9979 1.0045 1.0141 1.0105 1.0215 1.0060 1.0039 1.0144 1.0182 1.0061 1.0198 1.0157
dispcorr: -0.016746371 hartree
energy: -2002.881137993338
dipole: 0.90412 0.19080 1.09492 7.89196 -7.41950 0.47246 1.71881 -2.15190 -0.43309
magnitude: 1.26872 au
magnitude: 3.22483 debye
