program: Gaussian 09
title: 000065512
version: EM64L-G09RevD.01
frameworkgroup: C1[X(C9H9NO4)]
method: RPBEPBE
basis: SDD
operation: Freq
keyword: #pfreq=noraman
keyword: PBEPBE/SDD
title: #p freq=noraman PBEPBE/SDD
converged: YES YES NO NO
title: Mulliken charges:
elementType: O O O O N C C C C C C C C C H H H H H H H H H
charge: -0.377891 -0.465139 -0.262205 -0.214874 -0.448422 0.544639 0.198136 -0.554355 -0.330865 0.143193 -0.374110 0.214433 0.105492 -0.798774 0.278107 0.315899 0.222936 0.315701 0.240529 0.269763 0.235557 0.358763 0.383488
chargesum: 0.00000
title: Mulliken charges with hydrogens summed into heavy atoms:
elementType: O O O O N C C C C C C C C C
charge: -0.019128 -0.081651 -0.262205 -0.214874 -0.132721 0.544639 0.198136 -0.276249 -0.014966 0.143193 -0.151174 0.214433 0.105492 -0.052925
polarizability: 1.91026889e+02 -1.83390223e+00 1.35702194e+02 5.28886054e-02 -2.86522134e-02 5.26472547e+01
1716.lowfreq: -75.5048 -3.5043 -0.0004 0.0004 0.0005 3.4061 8.2342 37.4642 53.2305
frequency: -75.4964 37.4442 53.2152 72.8783 122.4564 128.9385 192.3128 202.7111 281.7844 304.6562 365.2604 370.6210 390.0919 401.7833 424.0279 497.4933 508.0560 543.8170 577.9964 594.2529 612.6868 633.3578 645.8435 698.0588 734.3831 764.5831 778.8246 827.6016 877.0722 924.9797 951.5992 976.9243 980.2146 999.7629 1030.4429 1093.0224 1149.2017 1169.1460 1221.0289 1252.0748 1266.7559 1297.3472 1319.8587 1370.5093 1376.5622 1412.2420 1449.0311 1468.3486 1495.6799 1521.0871 1598.7444 1622.7988 1631.1930 1659.1440 2987.7455 3072.6767 3119.5150 3136.2230 3154.4610 3194.4860 3524.7960 3534.5638 3551.4888
redmass: 1.0612 11.8011 7.0886 4.0361 5.2079 4.5305 4.8734 7.4499 9.4010 4.0041 6.4661 4.8333 8.9923 1.1373 3.0185 4.4008 4.5635 2.3099 2.1804 1.6753 5.4038 5.4897 1.2216 4.5263 5.9667 4.4897 5.3981 1.4901 5.2902 1.5713 5.0891 3.2938 1.3152 1.8919 1.6591 1.9251 1.4308 1.1763 3.2234 2.1213 1.7545 2.1439 2.2383 3.2765 1.3323 6.4556 1.1231 1.0473 2.9238 2.1006 6.5906 6.8506 4.8881 8.5831 1.0384 1.0984 1.0908 1.0979 1.0918 1.0948 1.0766 1.0642 1.0659
irintensity: 0.0320 1.5888 8.4951 2.6941 4.9742 4.6008 3.3711 9.0188 1.9716 0.4517 1.2532 0.2716 5.6515 130.4533 1.5619 21.5179 34.6784 0.5352 47.1469 158.1798 28.1953 5.6460 44.5432 17.6315 2.5233 9.0070 20.8211 54.0738 23.4157 31.6406 35.8848 209.3901 2.5745 35.9416 8.4028 141.3148 212.3896 28.1217 59.2938 42.4940 2.0672 92.4202 122.6349 59.6659 61.3316 5.6949 66.4929 20.1451 460.9216 94.1550 10.9818 85.4293 159.3848 278.1972 8.4884 15.0460 15.2856 7.0726 5.6720 9.6811 14.0120 41.8717 43.3283
temp: 298.150 k
press: 1.00000 atm
elementType: 8 8 8 8 7 6 6 6 6 6 6 6 6 6 1 1 1 1 1 1 1 1 1
symmnumber: 1
zpe: 443550.6 jmol-1
zpe.correction: 0.168939 hartree
zpe.thermalcorrener: 0.181557 hartree
zpe.thermalcorrenthalpy: 0.182502 hartree
zpe.thermalcorrgfe: 0.128959 hartree
zpe.sumelectzpe: -703.006245 hartree
zpe.sumelectthermal: -702.993627 hartree
zpe.sumelectthermalent: -702.992683 hartree
zpe.sumelectthermalfe: -703.046225 hartree
dipole: 2.0327 -2.0758 0.0192
dipole: 2.9054
quadrupole: -94.5886 -61.7588 -83.1049
quadrupole: -13.3448 0.0312 0.0276
quadrupole: -14.7712 18.0586 -3.2875 -13.3448 0.0312 0.0276
hfenergy: -703.1751843 hartree
pointgroup: C01 [X(C9H9N1O4)]
dipole: -0.7763904 0.8385463 0.0254051 debye
dipolederiv: -1.0250849 0.761876 0.0127635 0.6457978 -0.4821045 -0.011032 0.0115441 -0.0121836 -0.3766167 -0.3180866 0.0726402 -0.0019421 -0.1285831 -1.3561388 -0.0042998 -0.0038857 -0.0082148 -0.4396044 -0.8696106 0.013265 0.0102213 -0.5955873 -0.795666 0.008501 0.0114756 -0.0043157 -0.3441324 -1.1757141 0.0057325 0.0181323 -0.1177539 -0.5441999 0.0002386 0.0166405 -0.0025942 -0.3128527 -1.8689406 0.158294 0.0311014 0.0503851 -0.3142104 0.0003841 0.0314406 -0.0024633 -0.3256072 0.8516623 -0.4614578 -0.0147862 -0.7818812 -0.1144895 0.0136149 -0.0159817 0.0067784 0.0807181 -0.6092218 -0.4765701 0.0095635 -0.042367 -0.326372 -0.0004632 0.0103965 0.0071763 0.0018947 0.0784408 0.3901694 -0.0025116 -0.1246895 0.0000775 0.0026037 -0.0051554 -0.0067271 -0.1626171 -0.0735392 -0.1642346 -0.000875 0.1906955 0.1544206 -0.0028197 0.0013426 0.0031907 -0.121509 0.9464428 -0.7470552 -0.0158008 -0.3697888 0.4583137 0.0065678 -0.0133195 0.0128275 0.0680818 -0.3879089 0.3364362 0.0044635 -0.1174511 0.1380119 0.0031894 0.0020447 -0.0041011 -0.1838346 2.0575163 -0.0491958 -0.0412673 0.6809826 0.9818677 -0.0054989 -0.0520321 0.0134713 0.1662547 1.6698728 0.2933251 -0.0284119 0.454525 1.7001013 0.0019827 -0.025973 0.0049263 0.2311983 -0.2725704 0.1751796 0.0062905 0.3135679 -0.2376021 -0.0154132 0.0270181 -0.0219119 0.056563 0.1370069 0.06393 0.0005691 0.0687201 -0.0023231 -0.0016659 0.0012314 -0.0015383 0.1660995 0.1533804 -0.0711946 -0.0002628 -0.044431 0.1184532 0.0006698 0.0001906 0.0009934 0.1763412 0.050223 0.0624021 0.0020917 0.0409328 -0.1107838 -0.0016253 0.0017443 -0.0018224 0.1660458 0.1613419 -0.0447451 0.0025849 0.0132438 0.1024796 -0.0007859 0.002266 0.0011873 0.3065806 0.0615453 -0.0030791 -0.0540277 0.0342914 0.0362828 -0.0879962 -0.0040221 -0.1056131 -0.0403969 -0.0498646 -0.0296814 -0.0055289 -0.0973254 0.0673923 -0.0045929 -0.0125849 -0.0002519 0.131733 0.0608853 -0.0160836 0.061643 0.0285795 0.0129822 0.0976112 0.0083119 0.1168775 -0.0199477 0.3287799 -0.2082852 0.0001546 -0.1380948 0.1510057 0.0017493 0.0004306 0.0027872 0.3795877 0.0934438 -0.0616677 0.0058351 0.0362315 0.3625016 -0.0009194 0.006877 0.0015215 0.3960203 unknown
polarizability: 190.8333851|-3.3589054|135.8448808|-2.6036151|0.4490648|52.6980713 unknown
InChI: InChI=1S/C9H9NO4/c1-5(11)10-6-2-3-8(12)7(4-6)9(13)14/h2-4,10,12-13H,1H3
charge 0 multiplicity 1
23 atoms
O  2.832287 -1.910964 -0.078733
O  2.451106 2.373953 -0.056211
O  -3.743066 -0.961998 0.037203
O  3.962907 0.616825 -0.099378
N  -2.159952 0.770998 0.01199
C  -0.933842 0.045008 -0.011891
C  1.540238 0.154932 -0.053217
C  0.268493 0.784233 -0.030016
C  -0.871386 -1.376404 -0.018059
C  1.592154 -1.27231 -0.057874
C  0.381626 -2.010216 -0.040667
C  -3.465877 0.273632 0.038007
C  2.768893 0.989059 -0.072194
C  -4.538612 1.362688 0.071859
H  0.252079 1.878831 -0.026671
H  -1.797467 -1.953501 -0.005089
H  0.421935 -3.10746 -0.045029
H  -2.063987 1.78944 0.0130
H  -4.47413 1.957596 1.001978
H  -5.526045 0.88137 0.030813
H  -4.443682 2.054015 -0.78602
H  2.711839 -2.894903 -0.079097
H  3.308489 2.877375 -0.070705
