program: Orca
programVersion: 5.0.4
elementType: S S S P O O C C C C C C C C H H H H H H H H H H H H H H H H H H H
charge: 0
multiplicity: 1
keywords: wb97x-d3
keywords: def2-TZVPP
keywords: def2/J RIJCOSX
keywords: DEFGRID2
keywords: scfconv7
keywords: smallprint printgap noloewdin
keywords: NOSOSCF
formula: C8H19O2PS3
InChI: InChI=1/C8H19O2PS3/c1-4-9-11(12,10-5-2)14-8-7-13-6-3/h4-8H2,1-3H3
33 atoms
S  0.164129 -1.837584 -1.072217
S  -2.641547 0.312502 -0.776876
S  0.28737 0.204612 1.677203
P  0.886542 -0.119928 -0.12853
O  2.463158 -0.375997 -0.303417
O  0.687279 1.041503 -1.198386
C  -1.424671 -2.155988 -0.253235
C  -2.608066 -1.486795 -0.930205
C  3.146494 -1.302957 0.547342
C  0.498125 2.408032 -0.821115
C  -3.244024 0.474617 0.926965
C  3.92322 -0.574731 1.619273
C  1.78121 3.059207 -0.3560
C  -3.249006 1.938906 1.324183
H  -1.335792 -1.877126 0.797926
H  -1.53937 -3.241488 -0.292404
H  -3.53764 -1.895566 -0.524277
H  -2.605044 -1.708128 -1.998049
H  2.442983 -2.010467 0.995749
H  3.811495 -1.873941 -0.101609
H  0.112991 2.892528 -1.717454
H  -0.273316 2.469693 -0.050654
H  -4.248952 0.052198 0.990907
H  -2.587592 -0.081957 1.596966
H  4.494741 -1.291301 2.210333
H  4.625213 0.135866 1.183047
H  3.253791 -0.038044 2.290134
H  2.569123 2.962047 -1.101988
H  1.608235 4.122025 -0.182823
H  2.132695 2.624398 0.579534
H  -3.860705 2.538406 0.650108
H  -3.650765 2.052945 2.330953
H  -2.236405 2.340925 1.32521
totalener: -2002.86384304 hartree
nucrepener: 1603.03135226 hartree
electener: -3605.89519530 hartree
oneelecener: -5949.60023952 hartree
twoeener: 2343.70504422 hartree
kineticenergy: 1997.91591300 hartree
xcener: -120.697536729207 hartree
chargesum: -0.0000000
charge: -0.147175 -0.101257 -0.428226 0.640288 -0.334321 -0.305942 -0.132096 -0.129304 0.029785 0.047343 -0.144208 -0.236571 -0.231343 -0.260293 0.110850 0.116667 0.094534 0.109068 0.075433 0.095652 0.099126 0.064845 0.097301 0.094773 0.080952 0.084686 0.086520 0.092292 0.081269 0.077513 0.093181 0.088939 0.089715
qa: -0.1472 -0.1013 -0.4282 0.6403 -0.3343 -0.3059 -0.1321 -0.1293 0.0298 0.0473 -0.1442 -0.2366 -0.2313 -0.2603 0.1109 0.1167 0.0945 0.1091 0.0754 0.0957 0.0991 0.0648 0.0973 0.0948 0.0810 0.0847 0.0865 0.0923 0.0813 0.0775 0.0932 0.0889 0.0897
va: 2.3012 2.2285 1.9985 5.4301 2.1091 2.1202 3.8712 3.9639 3.8978 3.8890 3.9890 3.9293 3.9298 3.9376 1.0415 1.0097 1.0125 1.0145 1.0156 0.9933 0.9919 1.0144 1.0031 1.0028 1.0125 1.0034 1.0203 1.0072 1.0114 1.0186 1.0060 1.0045 1.0109
dispcorr: -0.016562433 hartree
energy: -2002.880405470893
dipole: -1.00570 0.87403 -0.13167 7.74999 -8.07909 -0.32910 8.50897 -8.26531 0.24366
magnitude: 0.43013 au
magnitude: 1.09331 debye
