program: Orca
programVersion: 5.0.4
elementType: S S S P O O C C C C C C C C H H H H H H H H H H H H H H H H H H H
charge: 0
multiplicity: 1
keywords: wb97x-d3
keywords: def2-TZVPP
keywords: def2/J RIJCOSX
keywords: DEFGRID2
keywords: scfconv7
keywords: smallprint printgap noloewdin
keywords: NOSOSCF
formula: C8H19O2PS3
InChI: InChI=1/C8H19O2PS3/c1-4-9-11(12,10-5-2)14-8-7-13-6-3/h4-8H2,1-3H3
33 atoms
S  -0.204546 -1.241536 -0.322053
S  -2.638164 1.14578 -0.527278
S  1.577271 0.04836 2.271107
P  1.328941 0.007537 0.371303
O  2.538513 -0.525914 -0.538257
O  1.054842 1.459246 -0.231261
C  -1.455818 -0.950212 0.963695
C  -2.030954 0.453956 1.027368
C  3.544642 -1.412002 -0.033167
C  0.828841 1.705098 -1.627063
C  -3.830654 -0.111037 -1.057561
C  3.047019 -2.829522 0.136818
C  0.393063 3.14083 -1.783812
C  -4.993996 -0.308882 -0.103459
H  -1.015396 -1.204923 1.929387
H  -2.233132 -1.687493 0.755852
H  -1.271778 1.155573 1.375921
H  -2.8233 0.465138 1.779345
H  4.348652 -1.367446 -0.767302
H  3.928378 -1.023622 0.912792
H  1.750796 1.514385 -2.181115
H  0.053098 1.03034 -1.996962
H  -4.189873 0.24685 -2.023852
H  -3.311367 -1.050922 -1.256257
H  3.880354 -3.470263 0.426984
H  2.289248 -2.895924 0.916533
H  2.625426 -3.220899 -0.788448
H  1.147715 3.832482 -1.411052
H  0.230667 3.355822 -2.84011
H  -0.5427 3.326356 -1.258244
H  -5.527355 0.6261 0.061005
H  -5.699051 -1.038256 -0.505135
H  -4.665893 -0.679544 0.868133
totalener: -2002.86456244 hartree
nucrepener: 1573.65774428 hartree
electener: -3576.52230672 hartree
oneelecener: -5890.50543696 hartree
twoeener: 2313.98313024 hartree
kineticenergy: 1997.90267363 hartree
xcener: -120.695351208652 hartree
chargesum: -0.0000000
charge: -0.163012 -0.120776 -0.388601 0.633205 -0.341042 -0.305042 -0.153584 -0.150647 0.016521 -0.033051 -0.115648 -0.236813 -0.215060 -0.243149 0.138054 0.112731 0.118470 0.110630 0.092614 0.093058 0.110881 0.100544 0.104955 0.080044 0.086788 0.086396 0.086681 0.089877 0.072628 0.083081 0.090780 0.090244 0.068243
qa: -0.1630 -0.1208 -0.3886 0.6332 -0.3410 -0.3050 -0.1536 -0.1506 0.0165 -0.0331 -0.1156 -0.2368 -0.2151 -0.2431 0.1381 0.1127 0.1185 0.1106 0.0926 0.0931 0.1109 0.1005 0.1050 0.0800 0.0868 0.0864 0.0867 0.0899 0.0726 0.0831 0.0908 0.0902 0.0682
va: 2.2739 2.2137 2.0682 5.4198 2.1053 2.1305 3.8960 3.9449 3.9078 3.8864 3.9660 3.8791 3.9350 3.9268 1.0273 0.9981 1.0291 1.0028 0.9905 1.0125 0.9983 1.0096 1.0047 1.0103 1.0138 1.0217 1.0053 1.0061 1.0080 1.0140 1.0130 1.0066 1.0033
dispcorr: -0.016323646 hartree
energy: -2002.880886090665
dipole: -11.00764 10.49888 -0.50877 -2.42843 1.71981 -0.70862 -6.56720 5.70595 -0.86126
magnitude: 1.22587 au
magnitude: 3.11591 debye
