program: Orca
programVersion: 5.0.4
elementType: S S S P O O C C C C C C C C H H H H H H H H H H H H H H H H H H H
charge: 0
multiplicity: 1
keywords: wb97x-d3
keywords: def2-TZVPP
keywords: def2/J RIJCOSX
keywords: DEFGRID2
keywords: scfconv7
keywords: smallprint printgap noloewdin
keywords: NOSOSCF
formula: C8H19O2PS3
InChI: InChI=1/C8H19O2PS3/c1-4-9-11(12,10-5-2)14-8-7-13-6-3/h4-8H2,1-3H3
33 atoms
S  0.342392 -0.590527 -1.698125
S  -3.535532 -1.601293 0.226397
S  -0.141768 1.913068 0.567721
P  1.012857 0.509467 -0.043028
O  1.334263 -0.543354 1.11636
O  2.476004 0.915684 -0.563505
C  -1.442906 -0.676053 -1.315357
C  -1.767587 -1.607625 -0.163653
C  2.170249 -1.695818 0.945873
C  2.771519 2.220587 -1.080314
C  -3.66823 -0.047123 1.161333
C  3.554451 -1.459125 1.504526
C  2.185918 2.456722 -2.453557
C  -3.030209 -0.094865 2.536942
H  -1.913991 -1.021801 -2.235673
H  -1.786733 0.340738 -1.125712
H  -1.200126 -1.350078 0.729799
H  -1.505281 -2.634612 -0.420058
H  1.671447 -2.502522 1.483498
H  2.213411 -1.991865 -0.105522
H  2.41849 2.976071 -0.375154
H  3.859411 2.267111 -1.107953
H  -3.25506 0.773871 0.573451
H  -4.741312 0.133571 1.239653
H  4.134102 -2.380168 1.436409
H  4.084245 -0.68606 0.951623
H  3.511824 -1.167692 2.553249
H  2.49618 1.688281 -3.160436
H  1.097451 2.481435 -2.425954
H  2.530709 3.42065 -2.828672
H  -3.207381 0.842473 3.066299
H  -3.439733 -0.908498 3.133439
H  -1.950107 -0.220366 2.476081
totalener: -2002.86552978 hartree
nucrepener: 1558.24540017 hartree
electener: -3561.11092995 hartree
oneelecener: -5859.42989075 hartree
twoeener: 2298.31896081 hartree
kineticenergy: 1997.89356401 hartree
xcener: -120.689979662301 hartree
chargesum: -0.0000000
charge: -0.174707 -0.125653 -0.387296 0.623469 -0.318060 -0.337654 -0.099108 -0.145586 0.025080 0.015585 -0.123437 -0.232304 -0.235876 -0.235670 0.120132 0.112161 0.086775 0.113434 0.092288 0.085441 0.095671 0.090700 0.086453 0.102433 0.081373 0.084539 0.088164 0.087176 0.087694 0.087331 0.086839 0.086157 0.076453
qa: -0.1747 -0.1257 -0.3873 0.6235 -0.3181 -0.3377 -0.0991 -0.1456 0.0251 0.0156 -0.1234 -0.2323 -0.2359 -0.2357 0.1201 0.1122 0.0868 0.1134 0.0923 0.0854 0.0957 0.0907 0.0865 0.1024 0.0814 0.0845 0.0882 0.0872 0.0877 0.0873 0.0868 0.0862 0.0765
va: 2.2773 2.2005 2.0646 5.4156 2.1096 2.1054 3.8501 3.9822 3.8781 3.9004 3.9695 3.9494 3.8830 3.9006 1.0159 1.0406 1.0318 1.0158 0.9893 1.0121 1.0105 0.9906 1.0154 1.0043 1.0093 1.0146 1.0051 1.0054 1.0211 1.0138 1.0060 1.0154 1.0164
dispcorr: -0.016514745 hartree
energy: -2002.882044523859
dipole: 3.97000 -2.85678 1.11322 -0.50856 0.30792 -0.20064 3.93485 -4.26781 -0.33296
magnitude: 1.17914 au
magnitude: 2.99714 debye
