program: Orca
programVersion: 5.0.4
elementType: S S S P O O C C C C C C C C H H H H H H H H H H H H H H H H H H H
charge: 0
multiplicity: 1
keywords: wb97x-d3
keywords: def2-TZVPP
keywords: def2/J RIJCOSX
keywords: DEFGRID2
keywords: scfconv7
keywords: smallprint printgap noloewdin
keywords: NOSOSCF
formula: C8H19O2PS3
InChI: InChI=1/C8H19O2PS3/c1-4-9-11(12,10-5-2)14-8-7-13-6-3/h4-8H2,1-3H3
33 atoms
S  0.127802 -0.198817 -1.381321
S  -3.327233 -0.722129 1.366326
S  0.953414 1.292913 1.554994
P  1.615494 0.49278 -0.062915
O  2.652866 -0.711724 0.082727
O  2.53442 1.391878 -1.014828
C  -1.421442 0.112219 -0.464014
C  -1.73998 -0.982225 0.536384
C  2.546372 -1.708256 1.102425
C  2.045039 2.643221 -1.503123
C  -4.481748 -1.29564 0.088038
C  1.79539 -2.929753 0.620215
C  3.122093 3.269734 -2.354723
C  -5.900444 -1.20381 0.623263
H  -2.1835 0.176202 -1.241807
H  -1.358349 1.080895 0.029009
H  -0.986741 -0.983617 1.325297
H  -1.728956 -1.966741 0.06363
H  3.573082 -1.96658 1.361376
H  2.079476 -1.282441 1.994487
H  1.136467 2.476702 -2.089863
H  1.785719 3.288678 -0.659866
H  -4.381897 -0.687583 -0.812704
H  -4.240014 -2.3268 -0.177226
H  0.75262 -2.707516 0.399689
H  2.249217 -3.345473 -0.278516
H  1.817933 -3.697027 1.394677
H  3.380819 2.63334 -3.200006
H  2.767063 4.222597 -2.747129
H  4.025171 3.459488 -1.776318
H  -6.160764 -0.177895 0.881796
H  -6.61133 -1.549809 -0.126932
H  -6.027626 -1.81833 1.513934
totalener: -2002.86482410 hartree
nucrepener: 1503.87371597 hartree
electener: -3506.73854007 hartree
oneelecener: -5750.60174301 hartree
twoeener: 2243.86320294 hartree
kineticenergy: 1997.88793548 hartree
xcener: -120.686804350462 hartree
chargesum: -0.0000000
charge: -0.181877 -0.104076 -0.393894 0.611299 -0.305373 -0.304064 -0.092475 -0.149941 0.019259 0.020782 -0.131204 -0.218572 -0.232347 -0.251306 0.111781 0.116368 0.111119 0.094825 0.096461 0.084659 0.083730 0.095701 0.079771 0.085462 0.062627 0.091969 0.086033 0.085239 0.074127 0.087961 0.090591 0.083854 0.091511
qa: -0.1819 -0.1041 -0.3939 0.6113 -0.3054 -0.3041 -0.0925 -0.1499 0.0193 0.0208 -0.1312 -0.2186 -0.2323 -0.2513 0.1118 0.1164 0.1111 0.0948 0.0965 0.0847 0.0837 0.0957 0.0798 0.0855 0.0626 0.0920 0.0860 0.0852 0.0741 0.0880 0.0906 0.0839 0.0915
va: 2.2790 2.2280 2.0564 5.4585 2.1466 2.1518 3.8394 3.9754 3.8959 3.8620 4.0227 3.9109 3.9686 3.9328 1.0126 1.0469 1.0317 1.0154 0.9926 1.0181 1.0011 1.0014 0.9955 0.9979 1.0133 1.0065 1.0131 1.0058 1.0076 1.0063 1.0083 1.0035 1.0096
dispcorr: -0.014176666 hartree
energy: -2002.879000766229
dipole: -10.93385 10.60318 -0.33067 -5.76670 5.28289 -0.48382 -4.63628 3.72009 -0.91619
magnitude: 1.08758 au
magnitude: 2.76440 debye
