program: Orca
programVersion: 5.0.4
elementType: S S S P O O C C C C C C C C H H H H H H H H H H H H H H H H H H H
charge: 0
multiplicity: 1
keywords: wb97x-d3
keywords: def2-TZVPP
keywords: def2/J RIJCOSX
keywords: DEFGRID2
keywords: scfconv7
keywords: smallprint printgap noloewdin
keywords: NOSOSCF
formula: C8H19O2PS3
InChI: InChI=1/C8H19O2PS3/c1-4-9-11(12,10-5-2)14-8-7-13-6-3/h4-8H2,1-3H3
33 atoms
S  0.608137 -1.115746 -1.310768
S  -3.702173 -0.630232 -0.367276
S  0.410171 0.546631 1.651629
P  1.445593 0.245127 0.054965
O  2.932948 -0.303232 0.242752
O  1.830167 1.531696 -0.811971
C  -1.062179 -1.39715 -0.63038
C  -2.042381 -0.307308 -1.01463
C  3.300946 -1.122967 1.357801
C  0.866307 2.528543 -1.161159
C  -3.512652 -0.094004 1.359646
C  2.710357 -2.514986 1.305203
C  0.455581 2.415338 -2.611985
C  -3.448848 1.411611 1.532286
H  -0.982471 -1.506738 0.450241
H  -1.374341 -2.356904 -1.042789
H  -2.14038 -0.24895 -2.099529
H  -1.694254 0.666825 -0.668886
H  4.38854 -1.164305 1.317468
H  3.0164 -0.621818 2.285803
H  -0.001333 2.470831 -0.496885
H  1.347348 3.488174 -0.970095
H  -4.384651 -0.503619 1.872063
H  -2.636297 -0.572767 1.79919
H  2.927835 -3.010149 0.35989
H  3.139155 -3.113893 2.109294
H  1.630046 -2.501071 1.446839
H  1.319977 2.475727 -3.272157
H  -0.06171 1.478726 -2.814124
H  -0.216831 3.235991 -2.86348
H  -4.32904 1.894513 1.110251
H  -3.39108 1.668785 2.59118
H  -2.564007 1.83229 1.055603
totalener: -2002.86385898 hartree
nucrepener: 1562.23642002 hartree
electener: -3565.10027899 hartree
oneelecener: -5867.24052088 hartree
twoeener: 2302.14024189 hartree
kineticenergy: 1997.89859566 hartree
xcener: -120.692142136212 hartree
chargesum: -0.0000000
charge: -0.165247 -0.124177 -0.420862 0.625231 -0.318659 -0.303006 -0.081081 -0.136942 0.021870 0.016860 -0.127785 -0.241642 -0.215294 -0.225329 0.096434 0.120146 0.118626 0.062663 0.097028 0.095161 0.063720 0.103304 0.103220 0.085987 0.093297 0.089565 0.079071 0.093944 0.067374 0.084817 0.088409 0.088330 0.064968
qa: -0.1652 -0.1242 -0.4209 0.6252 -0.3187 -0.3030 -0.0811 -0.1369 0.0219 0.0169 -0.1278 -0.2416 -0.2153 -0.2253 0.0964 0.1201 0.1186 0.0627 0.0970 0.0952 0.0637 0.1033 0.1032 0.0860 0.0933 0.0896 0.0791 0.0939 0.0674 0.0848 0.0884 0.0883 0.0650
va: 2.2869 2.2020 2.0171 5.4315 2.1393 2.1435 3.8379 4.0016 3.8874 3.9156 3.9720 3.8918 3.9136 3.9009 1.0449 1.0206 1.0113 1.0350 0.9913 1.0094 1.0100 0.9944 1.0062 1.0136 1.0067 1.0135 1.0124 1.0075 1.0222 1.0109 1.0159 1.0064 1.0102
dispcorr: -0.016989115 hartree
energy: -2002.880848090736
dipole: -6.53669 6.82236 0.28567 3.00851 -2.99288 0.01564 2.25086 -2.24548 0.00538
magnitude: 0.28615 au
magnitude: 0.72733 debye
