program: Orca
programVersion: 5.0.4
elementType: S S S P O O C C C C C C C C H H H H H H H H H H H H H H H H H H H
charge: 0
multiplicity: 1
keywords: wb97x-d3
keywords: def2-TZVPP
keywords: def2/J RIJCOSX
keywords: DEFGRID2
keywords: scfconv7
keywords: smallprint printgap noloewdin
keywords: NOSOSCF
formula: C8H19O2PS3
InChI: InChI=1/C8H19O2PS3/c1-4-9-11(12,10-5-2)14-8-7-13-6-3/h4-8H2,1-3H3
33 atoms
S  -0.361313 0.137641 -1.698752
S  -3.207544 -0.944315 1.541082
S  1.104877 1.439024 1.082458
P  1.31719 0.351248 -0.492786
O  1.775889 -1.162029 -0.255873
O  2.411353 0.841568 -1.559119
C  -1.697903 0.232959 -0.455743
C  -1.781776 -0.997835 0.427082
C  2.853809 -1.453715 0.650685
C  2.615397 2.235163 -1.8266
C  -4.542045 -1.403649 0.399943
C  2.320592 -2.009767 1.949783
C  3.851398 2.736071 -1.117062
C  -5.850219 -1.488311 1.167843
H  -2.602067 0.357296 -1.052949
H  -1.560471 1.134496 0.140343
H  -0.902785 -1.056697 1.070012
H  -1.809818 -1.911587 -0.169081
H  3.485935 -2.17915 0.13803
H  3.45901 -0.562795 0.83738
H  2.718818 2.3210 -2.908578
H  1.739733 2.817986 -1.529485
H  -4.626362 -0.666604 -0.400649
H  -4.305521 -2.366505 -0.057437
H  1.709071 -2.895626 1.780156
H  3.151003 -2.294825 2.596633
H  1.72322 -1.266374 2.476208
H  4.034341 3.776968 -1.385429
H  3.728225 2.683592 -0.036065
H  4.730758 2.157586 -1.399594
H  -5.796409 -2.235398 1.959103
H  -6.104962 -0.532061 1.623956
H  -6.66413 -1.766482 0.49856
totalener: -2002.86550691 hartree
nucrepener: 1508.98877843 hartree
electener: -3511.85428534 hartree
oneelecener: -5761.01757521 hartree
twoeener: 2249.16328987 hartree
kineticenergy: 1997.89407096 hartree
xcener: -120.685525107113 hartree
chargesum: -0.0000000
charge: -0.143345 -0.107350 -0.407968 0.606245 -0.312587 -0.337707 -0.129641 -0.104574 0.038956 0.031086 -0.131311 -0.242245 -0.233077 -0.251706 0.110830 0.126625 0.094533 0.097548 0.094608 0.076642 0.095762 0.082740 0.079558 0.086692 0.088810 0.086183 0.087436 0.082136 0.084744 0.084667 0.091177 0.090437 0.084096
qa: -0.1433 -0.1073 -0.4080 0.6062 -0.3126 -0.3377 -0.1296 -0.1046 0.0390 0.0311 -0.1313 -0.2422 -0.2331 -0.2517 0.1108 0.1266 0.0945 0.0975 0.0946 0.0766 0.0958 0.0827 0.0796 0.0867 0.0888 0.0862 0.0874 0.0821 0.0847 0.0847 0.0912 0.0904 0.0841
va: 2.3162 2.2240 2.0205 5.4395 2.1031 2.1046 3.8890 3.9504 3.9013 3.8819 4.0247 3.9171 3.9258 3.9324 1.0104 1.0386 1.0308 1.0227 0.9956 1.0072 0.9940 1.0138 0.9958 0.9977 1.0025 1.0143 1.0180 1.0127 1.0212 1.0039 1.0096 1.0082 1.0034
dispcorr: -0.014378156 hartree
energy: -2002.879885063724
dipole: -4.57722 4.77085 0.19364 -4.27983 4.00154 -0.27830 4.06787 -4.74058 -0.67271
magnitude: 0.75332 au
magnitude: 1.91478 debye
