program: Orca
programVersion: 5.0.4
elementType: Cl Cl Cl P O O O O C C C C C C C C C C H H H H H H H H H H
charge: 0
multiplicity: 1
keywords: wb97x-d3
keywords: def2-TZVPP
keywords: def2/J RIJCOSX
keywords: DEFGRID2
keywords: scfconv7
keywords: smallprint printgap noloewdin
keywords: NOSOSCF
formula: C10H10Cl3O4P
InChI: InChI=1/C10H10Cl3O4P/c1-15-18(14,16-2)17-10(6-11)8-4-3-7(12)5-9(8)13/h3-6H,1-2H3
28 atoms
Cl 1.414899 1.398707 -1.986498
Cl 4.79509 -0.161776 1.856775
Cl -2.426096 -2.064387 -2.154119
P  -1.716149 1.077247 0.474422
O  -1.307799 0.347527 -0.911481
O  -3.084822 1.759872 0.082389
O  -2.012268 -0.191083 1.381845
O  -0.751757 2.056375 1.009344
C  0.838084 -0.59373 -0.250309
C  -0.469512 -0.739513 -0.912068
C  1.763544 0.371515 -0.645049
C  1.169213 -1.420429 0.819463
C  2.982402 0.511256 -0.006773
C  2.383588 -1.303262 1.474341
C  3.276657 -0.332678 1.05331
C  -0.857281 -1.870637 -1.48478
C  -4.173205 1.049415 -0.529662
C  -1.855238 -0.156987 2.808855
H  0.45603 -2.163037 1.151644
H  3.690488 1.26037 -0.332394
H  2.619286 -1.955157 2.303643
H  -0.203623 -2.727617 -1.562854
H  -4.380022 0.110587 -0.017587
H  -3.962229 0.857498 -1.58005
H  -5.044106 1.693848 -0.450885
H  -0.897165 0.2748 3.093315
H  -1.897245 -1.188018 3.148398
H  -2.664162 0.407348 3.270871
elementType: Cl P O C H
totalener: -2410.14595977 hartree
nucrepener: 1985.63039083 hartree
electener: -4395.77635060 hartree
oneelecener: -7271.74743852 hartree
twoeener: 2875.97108791 hartree
cpcmener: -0.03440683 hartree
kineticenergy: 2404.49799611 hartree
xcener: -144.461434214883 hartree
chargesum: -0.0000000
charge: -0.060347 -0.076271 -0.082860 0.942702 -0.334000 -0.349581 -0.332456 -0.633312 0.119248 0.105372 0.010619 -0.204037 -0.116401 -0.129308 0.089062 -0.081076 -0.107160 -0.112942 0.160336 0.127282 0.150668 0.158656 0.121164 0.115026 0.132814 0.118634 0.128492 0.139678
qa: -0.0603 -0.0763 -0.0829 0.9427 -0.3340 -0.3496 -0.3325 -0.6333 0.1192 0.1054 0.0106 -0.2040 -0.1164 -0.1293 0.0891 -0.0811 -0.1072 -0.1129 0.1603 0.1273 0.1507 0.1587 0.1212 0.1150 0.1328 0.1186 0.1285 0.1397
va: 1.2634 1.2270 1.2333 5.5851 2.0861 2.1233 2.0549 1.9733 3.5505 3.8526 3.9524 3.9709 4.0412 3.9763 3.8841 4.0699 3.8276 3.8164 0.9953 1.0199 1.0016 1.0031 0.9928 0.9951 0.9931 0.9972 0.9884 0.9892
dispcorr: -0.016630592 hartree
energy: -2410.162590364569
dipole: -15.37739 14.26331 -1.11408 -3.15046 0.75407 -2.39639 11.18851 -10.30028 0.88823
magnitude: 2.78798 au
magnitude: 7.08648 debye
