program: Orca
programVersion: 5.0.4
elementType: Cl Cl Cl P O O O O C C C C C C C C C C H H H H H H H H H H
charge: 0
multiplicity: 1
keywords: wb97x-d3
keywords: def2-TZVPP
keywords: def2/J RIJCOSX
keywords: DEFGRID2
keywords: scfconv7
keywords: smallprint printgap noloewdin
keywords: NOSOSCF
formula: C10H10Cl3O4P
InChI: InChI=1/C10H10Cl3O4P/c1-15-18(14,16-2)17-10(6-11)8-4-3-7(12)5-9(8)13/h3-6H,1-2H3
28 atoms
Cl 0.81268 -0.313981 -2.458354
Cl 4.951696 1.238356 0.563559
Cl -2.477341 -2.86538 0.489784
P  -2.020341 1.033989 0.638083
O  -1.521951 -0.185909 -0.314083
O  -1.154912 2.296412 0.255613
O  -3.436556 1.350603 0.011962
O  -1.930225 0.711418 2.074573
C  0.814591 -0.506575 0.237701
C  -0.554488 -1.043643 0.150927
C  1.517612 -0.103924 -0.896103
C  1.427292 -0.357859 1.477523
C  2.789542 0.432398 -0.809847
C  2.701572 0.172105 1.593007
C  3.365918 0.566491 0.444173
C  -0.863103 -2.281734 0.507235
C  -1.071167 2.819687 -1.079262
C  -4.501214 0.384262 0.047649
H  0.892661 -0.658065 2.36869
H  3.322638 0.731513 -1.701499
H  3.159995 0.281641 2.565708
H  -0.110652 -2.99072 0.821997
H  -1.987779 3.344835 -1.342384
H  -0.876968 2.035202 -1.809443
H  -0.241247 3.520312 -1.084807
H  -4.607739 -0.054847 1.038962
H  -4.329371 -0.400571 -0.686939
H  -5.412746 0.918604 -0.203349
elementType: Cl P O C H
totalener: -2410.14705484 hartree
nucrepener: 1980.68063273 hartree
electener: -4390.82768758 hartree
oneelecener: -7261.50392637 hartree
twoeener: 2870.67623879 hartree
cpcmener: -0.03022656 hartree
kineticenergy: 2404.50062495 hartree
xcener: -144.460403992595 hartree
chargesum: -0.0000000
charge: -0.065687 -0.076894 -0.081286 0.946332 -0.343766 -0.349791 -0.340848 -0.625401 0.089142 0.102028 0.038344 -0.161354 -0.131829 -0.148054 0.099000 -0.068982 -0.117878 -0.111273 0.156182 0.129547 0.149838 0.156882 0.131837 0.117740 0.131906 0.121182 0.119360 0.133720
qa: -0.0657 -0.0769 -0.0813 0.9463 -0.3438 -0.3498 -0.3408 -0.6254 0.0891 0.1020 0.0383 -0.1614 -0.1318 -0.1481 0.0990 -0.0690 -0.1179 -0.1113 0.1562 0.1295 0.1498 0.1569 0.1318 0.1177 0.1319 0.1212 0.1194 0.1337
va: 1.2554 1.2262 1.2369 5.5834 2.0506 2.0978 2.1110 1.9742 3.5561 3.8467 3.9205 3.9760 4.0591 4.0036 3.8793 4.0894 3.8228 3.8252 1.0030 1.0195 1.0024 1.0042 0.9953 0.9986 0.9895 0.9925 0.9950 0.9924
dispcorr: -0.016700419 hartree
energy: -2410.163755262114
dipole: -12.04921 12.08081 0.03160 7.54059 -7.53627 0.00432 1.00838 -2.38279 -1.37441
magnitude: 1.37478 au
magnitude: 3.49441 debye
