program: Orca
programVersion: 5.0.4
elementType: Cl Cl Cl P O O O O C C C C C C C C C C H H H H H H H H H H
charge: 0
multiplicity: 1
keywords: wb97x-d3
keywords: def2-TZVPP
keywords: def2/J RIJCOSX
keywords: DEFGRID2
keywords: scfconv7
keywords: smallprint printgap noloewdin
keywords: NOSOSCF
formula: C10H10Cl3O4P
InChI: InChI=1/C10H10Cl3O4P/c1-15-18(14,16-2)17-10(6-11)8-4-3-7(12)5-9(8)13/h3-6H,1-2H3
28 atoms
Cl 0.414585 -1.206089 -2.165757
Cl 4.602256 1.644769 -0.479174
Cl -2.277457 -3.130044 1.071488
P  -2.152758 0.947345 0.498554
O  -1.523142 -0.296603 1.316553
O  -0.991184 1.999135 0.247212
O  -2.331891 0.292442 -0.926345
O  -3.334953 1.457527 1.216937
C  0.731087 -0.471858 0.436598
C  -0.551241 -1.111469 0.782012
C  1.251913 -0.455196 -0.855293
C  1.43544 0.200285 1.434362
C  2.444978 0.190248 -1.145399
C  2.623585 0.853298 1.170561
C  3.119193 0.835315 -0.124015
C  -0.770229 -2.413183 0.672025
C  -0.648621 2.982516 1.234196
C  -2.593124 1.065539 -2.107126
H  1.043375 0.20935 2.44307
H  2.832816 0.193906 -2.154506
H  3.15327 1.364028 1.96211
H  -0.004044 -3.09551 0.332964
H  -0.350533 2.51624 2.173257
H  -1.481545 3.661953 1.411165
H  0.192424 3.54214 0.834079
H  -2.851522 0.358668 -2.889931
H  -1.708372 1.625136 -2.405598
H  -3.427392 1.749876 -1.956422
elementType: Cl P O C H
totalener: -2410.14407037 hartree
nucrepener: 2003.89781533 hartree
electener: -4414.04188570 hartree
oneelecener: -7307.43037992 hartree
twoeener: 2893.38849422 hartree
cpcmener: -0.03418320 hartree
kineticenergy: 2404.50021178 hartree
xcener: -144.462305302554 hartree
chargesum: -0.0000000
charge: -0.067612 -0.077530 -0.083838 0.917065 -0.339129 -0.325598 -0.320498 -0.640168 0.088809 0.120685 0.009523 -0.156027 -0.131773 -0.147515 0.103848 -0.077264 -0.125350 -0.125725 0.157430 0.128366 0.149826 0.158447 0.128642 0.134633 0.131195 0.131402 0.122709 0.135449
qa: -0.0676 -0.0775 -0.0838 0.9171 -0.3391 -0.3256 -0.3205 -0.6402 0.0888 0.1207 0.0095 -0.1560 -0.1318 -0.1475 0.1038 -0.0773 -0.1254 -0.1257 0.1574 0.1284 0.1498 0.1584 0.1286 0.1346 0.1312 0.1314 0.1227 0.1354
va: 1.2449 1.2258 1.2316 5.5904 2.1036 2.0537 2.0874 1.9804 3.5256 3.7870 3.9592 3.8591 4.0586 3.9797 3.8723 4.0724 3.8253 3.8267 0.9996 1.0199 1.0023 1.0062 0.9828 0.9998 0.9875 0.9878 0.9917 0.9929
dispcorr: -0.017490241 hartree
energy: -2410.161560612305
dipole: -4.06303 6.23260 2.16958 13.89979 -13.00191 0.89788 1.36313 -2.10709 -0.74397
magnitude: 2.46308 au
magnitude: 6.26064 debye
