program: Orca
programVersion: 5.0.4
elementType: Cl Cl Cl P O O O O C C C C C C C C C C H H H H H H H H H H
charge: 0
multiplicity: 1
keywords: wb97x-d3
keywords: def2-TZVPP
keywords: def2/J RIJCOSX
keywords: DEFGRID2
keywords: scfconv7
keywords: smallprint printgap noloewdin
keywords: NOSOSCF
formula: C10H10Cl3O4P
InChI: InChI=1/C10H10Cl3O4P/c1-15-18(14,16-2)17-10(6-11)8-4-3-7(12)5-9(8)13/h3-6H,1-2H3
28 atoms
Cl 0.862212 -0.07497 -2.491097
Cl 4.625784 1.38715 1.008031
Cl -2.244917 -3.204642 -0.941119
P  -1.902407 0.959806 0.712296
O  -1.771048 -0.611733 0.337325
O  -1.225152 1.66979 -0.526287
O  -3.445181 1.187577 0.434636
O  -1.410444 1.319134 2.054613
C  0.672735 -0.603532 0.165795
C  -0.636305 -1.247462 -0.075824
C  1.430266 -0.045399 -0.86276
C  1.168125 -0.519649 1.464952
C  2.647915 0.567409 -0.61256
C  2.380769 0.085909 1.740076
C  3.109191 0.624297 0.691478
C  -0.733367 -2.439696 -0.647727
C  -0.418464 2.845232 -0.375474
C  -4.43884 0.729956 1.362775
H  0.597519 -0.94923 2.277809
H  3.222161 0.99655 -1.421975
H  2.748261 0.132058 2.755676
H  0.139893 -2.996276 -0.956298
H  0.362617 2.704848 0.37089
H  -1.032883 3.703306 -0.10345
H  0.04039 3.029092 -1.343148
H  -5.392225 1.119409 1.015697
H  -4.246166 1.102735 2.36858
H  -4.48519 -0.35933 1.379353
elementType: Cl P O C H
totalener: -2410.15202174 hartree
nucrepener: 1988.82793151 hartree
electener: -4398.97995325 hartree
oneelecener: -7277.61416082 hartree
twoeener: 2878.63420757 hartree
cpcmener: -0.02331698 hartree
kineticenergy: 2404.48684542 hartree
xcener: -144.459987180725 hartree
chargesum: 0.0000000
charge: -0.060425 -0.075161 -0.092694 0.938187 -0.308072 -0.338438 -0.352591 -0.599109 0.026846 0.157767 0.003872 -0.145018 -0.116465 -0.133301 0.085816 -0.097163 -0.115626 -0.113853 0.154190 0.126070 0.147704 0.155709 0.116923 0.146036 0.122213 0.127149 0.115901 0.123534
qa: -0.0604 -0.0752 -0.0927 0.9382 -0.3081 -0.3384 -0.3526 -0.5991 0.0268 0.1578 0.0039 -0.1450 -0.1165 -0.1333 0.0858 -0.0972 -0.1156 -0.1139 0.1542 0.1261 0.1477 0.1557 0.1169 0.1460 0.1222 0.1271 0.1159 0.1235
va: 1.2556 1.2274 1.2178 5.6026 2.1539 2.0795 2.1283 1.9843 3.6000 3.8431 3.9084 3.9110 4.0162 3.9925 3.8832 4.0324 3.8239 3.8393 1.0065 1.0216 1.0028 1.0045 0.9891 0.9924 0.9909 0.9885 0.9944 0.9905
dispcorr: -0.017075007 hartree
energy: -2410.169096745529
dipole: -10.10691 10.31406 0.20715 9.30958 -8.97524 0.33435 8.41749 -8.39629 0.02120
magnitude: 0.39389 au
magnitude: 1.00118 debye
