program: Orca
programVersion: 5.0.4
elementType: Cl Cl Cl P O O O O C C C C C C C C C C H H H H H H H H H H
charge: 0
multiplicity: 1
keywords: wb97x-d3
keywords: def2-TZVPP
keywords: def2/J RIJCOSX
keywords: DEFGRID2
keywords: scfconv7
keywords: smallprint printgap noloewdin
keywords: NOSOSCF
formula: C10H10Cl3O4P
InChI: InChI=1/C10H10Cl3O4P/c1-15-18(14,16-2)17-10(6-11)8-4-3-7(12)5-9(8)13/h3-6H,1-2H3
28 atoms
Cl 1.134001 0.942904 -2.408679
Cl 5.023505 0.37624 1.215089
Cl -2.401042 -2.756267 -1.343854
P  -2.083233 0.89921 0.134355
O  -1.35956 -0.019198 -0.976991
O  -2.582215 -0.096939 1.266977
O  -0.83499 1.601856 0.809497
O  -3.113752 1.744206 -0.490004
C  0.875377 -0.648874 -0.22693
C  -0.474858 -1.021031 -0.683269
C  1.684525 0.24441 -0.929397
C  1.387534 -1.210136 0.939691
C  2.957628 0.56664 -0.492819
C  2.660424 -0.910741 1.393826
C  3.432831 -0.018388 0.670322
C  -0.824375 -2.290953 -0.854053
C  -3.942692 -0.548344 1.313566
C  -1.00902 2.599749 1.82421
H  0.768114 -1.887271 1.512965
H  3.57177 1.254976 -1.056999
H  3.033242 -1.360301 2.303611
H  -0.125369 -3.102049 -0.706192
H  -4.195285 -1.146013 0.43865
H  -4.633146 0.290327 1.392361
H  -4.031431 -1.166698 2.202818
H  -0.012793 2.918391 2.119595
H  -1.525646 2.194048 2.694295
H  -1.55924 3.457553 1.438003
elementType: Cl P O C H
totalener: -2410.15454122 hartree
nucrepener: 1975.84326737 hartree
electener: -4385.99780859 hartree
oneelecener: -7251.79619610 hartree
twoeener: 2865.79838751 hartree
cpcmener: -0.02697837 hartree
kineticenergy: 2404.49867831 hartree
xcener: -144.459851833526 hartree
chargesum: 0.0000000
charge: -0.060295 -0.076692 -0.080501 0.909155 -0.332884 -0.338861 -0.313857 -0.608696 0.099393 0.107484 0.031242 -0.195725 -0.122780 -0.134170 0.085835 -0.060196 -0.107258 -0.120369 0.157295 0.124429 0.146661 0.155833 0.112841 0.123558 0.128935 0.122600 0.123051 0.123971
qa: -0.0603 -0.0767 -0.0805 0.9092 -0.3329 -0.3389 -0.3139 -0.6087 0.0994 0.1075 0.0312 -0.1957 -0.1228 -0.1342 0.0858 -0.0602 -0.1073 -0.1204 0.1573 0.1244 0.1467 0.1558 0.1128 0.1236 0.1289 0.1226 0.1231 0.1240
va: 1.2626 1.2266 1.2395 5.6107 2.1077 2.0595 2.1035 2.0155 3.5745 3.8485 3.9243 3.9970 4.0459 3.9857 3.8837 4.0388 3.8289 3.8448 0.9940 1.0212 1.0033 1.0033 0.9965 0.9984 0.9892 0.9893 0.9899 0.9922
dispcorr: -0.015832307 hartree
energy: -2410.170373523487
dipole: -11.66872 12.34597 0.67725 2.65701 -3.71968 -1.06267 15.25441 -12.90908 2.34532
magnitude: 2.66242 au
magnitude: 6.76733 debye
