program: Orca
programVersion: 5.0.4
elementType: Cl Cl Cl P O O O O C C C C C C C C C C H H H H H H H H H H
charge: 0
multiplicity: 1
keywords: wb97x-d3
keywords: def2-TZVPP
keywords: def2/J RIJCOSX
keywords: DEFGRID2
keywords: scfconv7
keywords: smallprint printgap noloewdin
keywords: NOSOSCF
formula: C10H10Cl3O4P
InChI: InChI=1/C10H10Cl3O4P/c1-15-18(14,16-2)17-10(6-11)8-4-3-7(12)5-9(8)13/h3-6H,1-2H3
28 atoms
Cl 0.035087 0.397984 2.519103
Cl 4.692593 1.263904 0.019027
Cl -2.328214 -3.49997 0.177776
P  -1.815989 0.540191 -1.046084
O  -1.743439 -0.613636 0.094319
O  -3.352941 0.893365 -1.031646
O  -1.062147 1.751963 -0.348453
O  -1.321594 0.137205 -2.372899
C  0.684843 -0.782778 0.176976
C  -0.643621 -1.42403 0.181291
C  1.080919 0.099589 1.18076
C  1.563749 -1.018748 -0.875273
C  2.310891 0.731757 1.145075
C  2.804483 -0.406121 -0.931005
C  3.159511 0.470964 0.079339
C  -0.791149 -2.739689 0.259204
C  -4.086183 1.253017 0.146742
C  -0.10895 2.552345 -1.059403
H  1.264993 -1.688878 -1.670255
H  2.602895 1.410246 1.934781
H  3.472868 -0.602394 -1.757882
H  0.05308 -3.401575 0.38979
H  -3.553436 1.99131 0.746439
H  -4.296238 0.371121 0.751612
H  -5.025046 1.685816 -0.190413
H  0.704525 1.945625 -1.457938
H  0.294667 3.259914 -0.339602
H  -0.583016 3.1042 -1.871694
elementType: Cl P O C H
totalener: -2410.15420021 hartree
nucrepener: 2002.04455917 hartree
electener: -4412.19875938 hartree
oneelecener: -7303.96757006 hartree
twoeener: 2891.76881068 hartree
cpcmener: -0.02542641 hartree
kineticenergy: 2404.49349306 hartree
xcener: -144.460329765368 hartree
chargesum: -0.0000000
charge: -0.059016 -0.075056 -0.085087 0.924815 -0.320755 -0.346758 -0.334613 -0.600199 0.053183 0.107723 0.061977 -0.164866 -0.134133 -0.144731 0.098086 -0.092283 -0.104447 -0.120741 0.155408 0.125084 0.146761 0.155693 0.119097 0.119376 0.126632 0.117571 0.129154 0.142126
qa: -0.0590 -0.0751 -0.0851 0.9248 -0.3208 -0.3468 -0.3346 -0.6002 0.0532 0.1077 0.0620 -0.1649 -0.1341 -0.1447 0.0981 -0.0923 -0.1044 -0.1207 0.1554 0.1251 0.1468 0.1557 0.1191 0.1194 0.1266 0.1176 0.1292 0.1421
va: 1.2657 1.2279 1.2274 5.5974 2.0972 2.1386 2.0535 2.0067 3.5779 3.8825 3.9031 3.9777 4.0255 3.9875 3.8668 4.0692 3.8345 3.8272 1.0007 1.0212 1.0039 1.0039 0.9937 0.9920 0.9898 0.9860 0.9877 0.9938
dispcorr: -0.017434135 hartree
energy: -2410.171634348024
dipole: -6.13021 6.75355 0.62334 9.87590 -8.85144 1.02446 -6.09076 7.04817 0.95741
magnitude: 1.53450 au
magnitude: 3.90039 debye
