program: Orca
programVersion: 5.0.4
elementType: Cl Cl Cl P O O O O C C C C C C C C C C H H H H H H H H H H
charge: 0
multiplicity: 1
keywords: wb97x-d3
keywords: def2-TZVPP
keywords: def2/J RIJCOSX
keywords: DEFGRID2
keywords: scfconv7
keywords: smallprint printgap noloewdin
keywords: NOSOSCF
formula: C10H10Cl3O4P
InChI: InChI=1/C10H10Cl3O4P/c1-15-18(14,16-2)17-10(6-11)8-4-3-7(12)5-9(8)13/h3-6H,1-2H3
28 atoms
Cl 0.552031 1.160908 2.15445
Cl 4.84908 0.555118 -0.984077
Cl -2.424154 -2.878165 1.639828
P  -1.908354 0.491146 -0.996132
O  -1.704802 -0.312753 0.397558
O  -3.359303 1.073744 -0.781814
O  -0.909571 1.715653 -0.847221
O  -1.769478 -0.319126 -2.216926
C  0.700727 -0.718522 0.221477
C  -0.652878 -1.156785 0.615201
C  1.341326 0.343115 0.85836
C  1.372482 -1.368028 -0.808217
C  2.613651 0.745967 0.494934
C  2.649524 -0.988987 -1.188619
C  3.255805 0.067479 -0.530615
C  -0.857626 -2.329542 1.199208
C  -3.748546 1.824966 0.376403
C  0.005627 2.082396 -1.886744
H  0.885066 -2.186459 -1.321006
H  3.098225 1.566182 1.006972
H  3.156491 -1.509629 -1.989102
H  -0.041616 -2.993863 1.445269
H  -3.871063 1.16871 1.237439
H  -4.704549 2.285578 0.141562
H  -3.028345 2.608195 0.612859
H  -0.522791 2.528584 -2.729024
H  0.587316 1.229416 -2.235395
H  0.678368 2.8212 -1.45915
elementType: Cl P O C H
totalener: -2410.15475072 hartree
nucrepener: 1997.54097841 hartree
electener: -4407.69572914 hartree
oneelecener: -7294.78254298 hartree
twoeener: 2887.08681384 hartree
cpcmener: -0.02541972 hartree
kineticenergy: 2404.49441875 hartree
xcener: -144.461188109590 hartree
chargesum: 0.0000000
charge: -0.058593 -0.074119 -0.086489 0.918862 -0.312625 -0.346446 -0.334049 -0.601151 0.040423 0.114592 0.073417 -0.149628 -0.146093 -0.154383 0.110661 -0.100162 -0.105188 -0.125201 0.153203 0.124814 0.145736 0.154928 0.118854 0.127272 0.119033 0.144251 0.119562 0.128517
qa: -0.0586 -0.0741 -0.0865 0.9189 -0.3126 -0.3464 -0.3340 -0.6012 0.0404 0.1146 0.0734 -0.1496 -0.1461 -0.1544 0.1107 -0.1002 -0.1052 -0.1252 0.1532 0.1248 0.1457 0.1549 0.1189 0.1273 0.1190 0.1443 0.1196 0.1285
va: 1.2667 1.2287 1.2253 5.6013 2.1023 2.1359 2.0510 2.0075 3.5814 3.8827 3.8866 3.9576 4.0339 3.9944 3.8598 4.0691 3.8344 3.8289 1.0020 1.0210 1.0045 1.0042 0.9927 0.9904 0.9938 0.9941 0.9866 0.9863
dispcorr: -0.017449087 hartree
energy: -2410.172199810384
dipole: -5.92162 6.99345 1.07183 8.23172 -7.10833 1.12339 -7.90197 8.47585 0.57389
magnitude: 1.65535 au
magnitude: 4.20756 debye
