program: Orca
programVersion: 5.0.4
elementType: Cl Cl Cl P O O O O C C C C C C C C C C H H H H H H H H H H
charge: 0
multiplicity: 1
keywords: wb97x-d3
keywords: def2-TZVPP
keywords: def2/J RIJCOSX
keywords: DEFGRID2
keywords: scfconv7
keywords: smallprint printgap noloewdin
keywords: NOSOSCF
formula: C10H10Cl3O4P
InChI: InChI=1/C10H10Cl3O4P/c1-15-18(14,16-2)17-10(6-11)8-4-3-7(12)5-9(8)13/h3-6H,1-2H3
28 atoms
Cl 0.653514 -0.203247 -2.451056
Cl 5.117896 1.060254 0.192238
Cl -2.449574 -2.804961 -0.252427
P  -2.080516 0.842399 0.974678
O  -1.278265 -0.532129 1.254767
O  -0.883926 1.801732 0.582549
O  -2.83574 0.641635 -0.406188
O  -2.920587 1.189851 2.132255
C  0.911225 -0.568998 0.23777
C  -0.457039 -1.111253 0.319091
C  1.512397 -0.158979 -0.951142
C  1.643022 -0.429132 1.416784
C  2.805885 0.34127 -0.973968
C  2.931969 0.067616 1.42016
C  3.504744 0.444497 0.215535
C  -0.862156 -2.167872 -0.373178
C  -1.11913 3.140228 0.126115
C  -4.238402 0.351579 -0.462701
H  1.196476 -0.728674 2.356045
H  3.253993 0.6540 -1.906944
H  3.478568 0.156652 2.348619
H  -0.207667 -2.693716 -1.053445
H  -1.549513 3.139246 -0.874984
H  -0.151341 3.633981 0.098317
H  -1.775081 3.683751 0.806542
H  -4.493973 -0.53778 0.112042
H  -4.473548 0.174807 -1.509309
H  -4.823544 1.197266 -0.103067
elementType: Cl P O C H
totalener: -2410.15394818 hartree
nucrepener: 1979.15873590 hartree
electener: -4389.31268407 hartree
oneelecener: -7258.28795847 hartree
twoeener: 2868.97527439 hartree
cpcmener: -0.02501373 hartree
kineticenergy: 2404.48973168 hartree
xcener: -144.458792689193 hartree
chargesum: 0.0000000
charge: -0.066464 -0.076647 -0.079027 0.912153 -0.345961 -0.317346 -0.338533 -0.606467 0.101688 0.139275 -0.041527 -0.126250 -0.119875 -0.154546 0.089443 -0.052143 -0.121512 -0.118177 0.148091 0.125192 0.146816 0.151168 0.122342 0.124548 0.126170 0.116258 0.132522 0.128807
qa: -0.0665 -0.0766 -0.0790 0.9122 -0.3460 -0.3173 -0.3385 -0.6065 0.1017 0.1393 -0.0415 -0.1263 -0.1199 -0.1545 0.0894 -0.0521 -0.1215 -0.1182 0.1481 0.1252 0.1468 0.1512 0.1223 0.1245 0.1262 0.1163 0.1325 0.1288
va: 1.2490 1.2271 1.2405 5.6105 2.1083 2.1033 2.0541 2.0160 3.5740 3.7789 3.9625 3.9241 4.0274 4.0041 3.8835 4.0472 3.8414 3.8317 1.0057 1.0202 1.0037 1.0102 0.9923 0.9890 0.9918 0.9925 0.9881 0.9967
dispcorr: -0.016156858 hartree
energy: -2410.170105033957
dipole: -11.62698 12.10113 0.47414 9.85565 -9.47865 0.37700 2.67093 -3.97650 -1.30557
magnitude: 1.43925 au
magnitude: 3.65829 debye
