program: Orca
programVersion: 5.0.4
elementType: Cl Cl Cl P O O O O C C C C C C C C C C H H H H H H H H H H
charge: 0
multiplicity: 1
keywords: wb97x-d3
keywords: def2-TZVPP
keywords: def2/J RIJCOSX
keywords: DEFGRID2
keywords: scfconv7
keywords: smallprint printgap noloewdin
keywords: NOSOSCF
formula: C10H10Cl3O4P
InChI: InChI=1/C10H10Cl3O4P/c1-15-18(14,16-2)17-10(6-11)8-4-3-7(12)5-9(8)13/h3-6H,1-2H3
28 atoms
Cl 0.96423 -0.343201 -2.481172
Cl 4.966104 1.152005 0.747239
Cl -2.435536 -2.922073 0.148491
P  -1.983465 1.075837 0.633662
O  -1.520452 -0.133605 -0.36548
O  -1.180016 2.351416 0.155009
O  -3.439516 1.359597 0.063932
O  -1.817009 0.758099 2.052957
C  0.806522 -0.48371 0.211966
C  -0.562434 -1.01225 0.048068
C  1.586906 -0.129388 -0.885701
C  1.340271 -0.303839 1.483465
C  2.866731 0.373053 -0.733748
C  2.619678 0.194663 1.661537
C  3.37174 0.528909 0.548038
C  -0.848692 -2.286044 0.274264
C  -1.115732 2.769562 -1.204094
C  -4.496066 0.426645 0.278919
H  0.728459 -0.542755 2.342334
H  3.461624 0.631476 -1.597948
H  3.022154 0.331981 2.654854
H  -0.08106 -2.997567 0.54022
H  -2.093491 3.085256 -1.568215
H  -0.729024 1.980678 -1.849948
H  -0.434418 3.615736 -1.237418
H  -4.599363 0.181523 1.336112
H  -4.330011 -0.489611 -0.287872
H  -5.409968 0.902135 -0.067922
totalener: -2410.13698691 hartree
nucrepener: 1977.28669339 hartree
electener: -4387.42368030 hartree
oneelecener: -7254.05052219 hartree
twoeener: 2866.62684189 hartree
kineticenergy: 2404.55093168 hartree
xcener: -144.464907014451 hartree
chargesum: -0.0000000
charge: -0.053541 -0.060113 -0.070509 0.887413 -0.342405 -0.316260 -0.328241 -0.497554 -0.007315 0.170705 0.037370 -0.097729 -0.148135 -0.139960 0.097112 -0.077304 -0.130881 -0.131140 0.145081 0.117585 0.127517 0.119366 0.120277 0.107931 0.119667 0.122331 0.111032 0.117699
qa: -0.0535 -0.0601 -0.0705 0.8874 -0.3424 -0.3163 -0.3282 -0.4976 -0.0073 0.1707 0.0374 -0.0977 -0.1481 -0.1400 0.0971 -0.0773 -0.1309 -0.1311 0.1451 0.1176 0.1275 0.1194 0.1203 0.1079 0.1197 0.1223 0.1110 0.1177
va: 1.2684 1.2442 1.2464 5.6144 2.0557 2.1201 2.1136 2.1244 3.7044 3.8529 3.9248 3.9570 4.0728 4.0227 3.9418 4.1035 3.8606 3.8647 1.0151 1.0244 1.0108 1.0154 0.9960 1.0005 0.9899 0.9908 0.9989 0.9917
dispcorr: -0.016635677 hartree
energy: -2410.153622590538
dipole: -12.73841 12.60672 -0.13170 7.74060 -7.65450 0.08611 1.64156 -2.41576 -0.77421
magnitude: 0.79004 au
magnitude: 2.00811 debye
