program: Orca
programVersion: 5.0.2
elementType: Cl Cl Cl P O O O O C C C C C C C C C C H H H H H H H H H H
charge: 0
multiplicity: 1
keywords: wb97x-d3
keywords: def2-TZVPP
keywords: def2/J RIJCOSX
keywords: DEFGRID2
keywords: scfconv7
keywords: smallprint printgap noloewdin
keywords: NOSOSCF
formula: C10H10Cl3O4P
InChI: InChI=1/C10H10Cl3O4P/c1-15-18(14,16-2)17-10(6-11)8-4-3-7(12)5-9(8)13/h3-6H,1-2H3
28 atoms
Cl 1.62859 0.843011 2.172528
Cl 4.126192 -2.406562 -1.272078
Cl -0.042359 2.870189 -1.68271
P  -2.603615 -0.45968 0.975634
O  -1.322882 0.494335 1.195084
O  -3.656704 0.558417 0.370272
O  -2.262582 -1.386018 -0.267492
O  -2.952794 -1.140995 2.235879
C  0.591421 0.179776 -0.231994
C  -0.585343 0.987688 0.130271
C  1.65069 0.017249 0.656829
C  0.657838 -0.471499 -1.459323
C  2.744923 -0.77263 0.34959
C  1.739497 -1.268538 -1.792427
C  2.770865 -1.412641 -0.878924
C  -0.952252 2.132687 -0.428102
C  -4.968943 0.100811 0.001071
C  -1.646531 -2.671088 -0.085583
H  -0.155229 -0.362552 -2.164191
H  3.559677 -0.88102 1.051795
H  1.77114 -1.771924 -2.748426
H  -1.82922 2.683949 -0.116461
H  -5.474702 -0.362204 0.847652
H  -4.917051 -0.606065 -0.826235
H  -5.527804 0.977596 -0.312372
H  -1.427752 -3.052163 -1.078883
H  -2.327668 -3.355007 0.418614
H  -0.717154 -2.596383 0.47873
elementType: Cl P O C H
totalener: -2410.14372299 hartree
nucrepener: 1965.04371432 hartree
electener: -4375.18743731 hartree
oneelecener: -7229.73637240 hartree
twoeener: 2854.54893508 hartree
cpcmener: -0.03185330 hartree
kineticenergy: 2404.48769656 hartree
xcener: -144.457026600536 hartree
chargesum: -0.0000000
charge: -0.063045 -0.077291 -0.070520 0.941009 -0.337402 -0.337617 -0.343793 -0.637819 0.001082 0.115135 0.053838 -0.164429 -0.141217 -0.124444 0.091118 -0.044710 -0.110821 -0.126553 0.162783 0.128468 0.150174 0.158642 0.119839 0.125350 0.128561 0.133784 0.138861 0.131017
qa: -0.0630 -0.0773 -0.0705 0.9410 -0.3374 -0.3376 -0.3438 -0.6378 0.0011 0.1151 0.0538 -0.1644 -0.1412 -0.1244 0.0911 -0.0447 -0.1108 -0.1266 0.1628 0.1285 0.1502 0.1586 0.1198 0.1253 0.1286 0.1338 0.1389 0.1310
va: 1.2614 1.2259 1.2473 5.5909 2.0936 2.1068 2.0509 1.9768 3.5745 3.8281 3.9572 3.8841 4.0602 3.9824 3.8768 4.0941 3.8325 3.8196 1.0018 1.0192 1.0018 1.0015 0.9927 0.9908 0.9888 0.9875 0.9992 0.9808
dispcorr: -0.016409329 hartree
energy: -2410.160132322031
dipole: -21.01502 20.27404 -0.74098 -9.58124 8.93619 -0.64505 -4.07554 1.83618 -2.23935
magnitude: 2.44537 au
magnitude: 6.21564 debye
