program: Orca
programVersion: 5.0.2
elementType: Cl Cl Cl P O O O O C C C C C C C C C C H H H H H H H H H H
charge: 0
multiplicity: 1
keywords: wb97x-d3
keywords: def2-TZVPP
keywords: def2/J RIJCOSX
keywords: DEFGRID2
keywords: scfconv7
keywords: smallprint printgap noloewdin
keywords: NOSOSCF
formula: C10H10Cl3O4P
InChI: InChI=1/C10H10Cl3O4P/c1-15-18(14,16-2)17-10(6-11)8-4-3-7(12)5-9(8)13/h3-6H,1-2H3
28 atoms
Cl 0.658775 1.503264 1.845437
Cl 4.091695 -2.217143 0.154264
Cl 0.5747 3.390354 -0.979804
P  -2.575221 -0.674124 -0.038555
O  -1.956255 0.397128 -1.078424
O  -1.695456 -1.9933 -0.125126
O  -2.130589 -0.052894 1.341344
O  -4.011518 -0.853849 -0.323566
C  0.424258 0.293966 -0.576871
C  -0.780076 1.091737 -0.865044
C  1.148303 0.408894 0.607582
C  0.851579 -0.640992 -1.51841
C  2.280077 -0.358107 0.838738
C  1.973767 -1.419613 -1.309504
C  2.681042 -1.263196 -0.127689
C  -0.828138 2.404884 -1.046758
C  -1.892132 -2.925261 -1.198813
C  -2.221562 -0.76951 2.581218
H  0.298462 -0.753043 -2.441968
H  2.833633 -0.250643 1.761078
H  2.291135 -2.131339 -2.058514
H  -1.747811 2.927691 -1.274142
H  -2.905077 -3.326173 -1.188343
H  -1.184775 -3.734516 -1.042551
H  -1.693889 -2.460458 -2.164878
H  -3.214977 -1.195594 2.71915
H  -2.030946 -0.049382 3.371337
H  -1.472573 -1.558471 2.624722
elementType: Cl P O C H
totalener: -2410.14149706 hartree
nucrepener: 2011.83152075 hartree
electener: -4421.97301781 hartree
oneelecener: -7323.36665787 hartree
twoeener: 2901.39364006 hartree
cpcmener: -0.03205509 hartree
kineticenergy: 2404.49237247 hartree
xcener: -144.461769508063 hartree
chargesum: -0.0000000
charge: -0.061642 -0.077506 -0.074134 0.921778 -0.327694 -0.332708 -0.320470 -0.642372 0.031788 0.129286 0.025352 -0.171100 -0.118858 -0.141409 0.095230 -0.067081 -0.119318 -0.120068 0.162913 0.126259 0.149515 0.158599 0.130914 0.131155 0.125567 0.134324 0.125297 0.126385
qa: -0.0616 -0.0775 -0.0741 0.9218 -0.3277 -0.3327 -0.3205 -0.6424 0.0318 0.1293 0.0254 -0.1711 -0.1189 -0.1414 0.0952 -0.0671 -0.1193 -0.1201 0.1629 0.1263 0.1495 0.1586 0.1309 0.1312 0.1256 0.1343 0.1253 0.1264
va: 1.2555 1.2263 1.2489 5.5854 2.0916 2.0499 2.0936 1.9798 3.5138 3.8049 3.9397 3.9107 4.0444 3.9873 3.8798 4.0607 3.8206 3.8246 0.9949 1.0204 1.0024 0.9982 1.0009 0.9889 0.9850 0.9939 0.9908 0.9893
dispcorr: -0.017215772 hartree
energy: -2410.158712834167
dipole: -13.09692 14.18675 1.08983 -14.55475 13.18095 -1.37380 -1.06230 1.12276 0.06046
magnitude: 1.75463 au
magnitude: 4.45990 debye
