program: Orca
programVersion: 5.0.2
elementType: Cl Cl Cl P O O O O C C C C C C C C C C H H H H H H H H H H
charge: 0
multiplicity: 1
keywords: wb97x-d3
keywords: def2-TZVPP
keywords: def2/J RIJCOSX
keywords: DEFGRID2
keywords: scfconv7
keywords: smallprint printgap noloewdin
keywords: NOSOSCF
formula: C10H10Cl3O4P
InChI: InChI=1/C10H10Cl3O4P/c1-15-18(14,16-2)17-10(6-11)8-4-3-7(12)5-9(8)13/h3-6H,1-2H3
28 atoms
Cl 0.065447 1.753091 1.568219
Cl 4.30942 -1.486831 1.327114
Cl 0.383887 3.14816 -1.535214
P  -2.474919 -0.997248 -0.424772
O  -1.605322 -0.234765 -1.551579
O  -1.482536 -1.880075 0.445828
O  -2.811992 0.19688 0.551067
O  -3.577739 -1.72477 -1.079575
C  0.582863 0.177061 -0.580984
C  -0.624077 0.692768 -1.249733
C  0.992408 0.599697 0.681614
C  1.341705 -0.798544 -1.223933
C  2.138161 0.094334 1.276667
C  2.48593 -1.320837 -0.650546
C  2.875814 -0.859707 0.596923
C  -0.813479 1.930399 -1.686234
C  -1.036788 -3.163413 -0.014783
C  -3.276967 -0.003419 1.894117
H  1.035674 -1.14778 -2.201345
H  2.443131 0.436522 2.25582
H  3.065894 -2.068175 -1.173399
H  -1.722943 2.23804 -2.18544
H  -0.434758 -3.068761 -0.918702
H  -1.880211 -3.826419 -0.206211
H  -0.42391 -3.583879 0.778509
H  -2.491744 -0.426468 2.518618
H  -4.15354 -0.650534 1.91629
H  -3.548672 0.976014 2.276639
elementType: Cl P O C H
totalener: -2410.14264146 hartree
nucrepener: 2009.09838443 hartree
electener: -4419.24102589 hartree
oneelecener: -7317.84250683 hartree
twoeener: 2898.60148094 hartree
cpcmener: -0.03187042 hartree
kineticenergy: 2404.48661258 hartree
xcener: -144.460195108192 hartree
chargesum: -0.0000000
charge: -0.061839 -0.077598 -0.071606 0.923584 -0.334369 -0.327036 -0.326160 -0.641760 0.038303 0.112359 0.024701 -0.175809 -0.117024 -0.130936 0.091970 -0.052372 -0.119626 -0.120895 0.157844 0.126915 0.149563 0.158969 0.125747 0.131102 0.130474 0.119589 0.134695 0.131214
qa: -0.0618 -0.0776 -0.0716 0.9236 -0.3344 -0.3270 -0.3262 -0.6418 0.0383 0.1124 0.0247 -0.1758 -0.1170 -0.1309 0.0920 -0.0524 -0.1196 -0.1209 0.1578 0.1269 0.1496 0.1590 0.1257 0.1311 0.1305 0.1196 0.1347 0.1312
va: 1.2565 1.2257 1.2521 5.5879 2.0881 2.0587 2.0899 1.9808 3.5301 3.7869 3.9442 3.8793 4.0475 3.9744 3.8787 4.0766 3.8239 3.8266 1.0003 1.0193 1.0018 0.9972 0.9828 1.0004 0.9883 0.9937 0.9925 0.9870
dispcorr: -0.017300192 hartree
energy: -2410.159941649792
dipole: -11.76594 12.79677 1.03084 -14.02715 13.35134 -0.67581 1.39441 -0.43587 0.95854
magnitude: 1.56146 au
magnitude: 3.96891 debye
