program: Orca
programVersion: 5.0.2
elementType: Cl Cl Cl P O O O O C C C C C C C C C C H H H H H H H H H H
charge: 0
multiplicity: 1
keywords: wb97x-d3
keywords: def2-TZVPP
keywords: def2/J RIJCOSX
keywords: DEFGRID2
keywords: scfconv7
keywords: smallprint printgap noloewdin
keywords: NOSOSCF
formula: C10H10Cl3O4P
InChI: InChI=1/C10H10Cl3O4P/c1-15-18(14,16-2)17-10(6-11)8-4-3-7(12)5-9(8)13/h3-6H,1-2H3
28 atoms
Cl 1.554288 1.081886 1.944372
Cl 4.04237 -2.146683 -1.504194
Cl 0.571418 3.514777 -0.177165
P  -2.128835 -0.842712 0.793144
O  -1.927916 0.496146 -0.104382
O  -3.707491 -0.869817 0.921846
O  -1.82043 -2.071756 -0.148928
O  -1.320072 -0.858857 2.02564
C  0.470718 0.388598 -0.447442
C  -0.731448 1.182337 -0.138036
C  1.553818 0.274901 0.422222
C  0.517132 -0.319147 -1.647943
C  2.657909 -0.500803 0.103211
C  1.606321 -1.098712 -1.98902
C  2.669551 -1.179006 -1.103303
C  -0.797543 2.499029 0.01152
C  -4.383068 0.083479 1.760271
C  -2.478654 -2.291154 -1.407159
H  -0.313656 -0.247737 -2.338171
H  3.489187 -0.578405 0.790245
H  1.622916 -1.631173 -2.929623
H  -1.724915 3.011261 0.231984
H  -5.443284 -0.144108 1.698801
H  -4.214882 1.101916 1.410879
H  -4.05492 -0.008256 2.794964
H  -2.478595 -1.39282 -2.023874
H  -3.502807 -2.627483 -1.250311
H  -1.919386 -3.070525 -1.91717
elementType: Cl P O C H
totalener: -2410.14316912 hartree
nucrepener: 1985.60152564 hartree
electener: -4395.74469476 hartree
oneelecener: -7271.91154946 hartree
twoeener: 2876.16685470 hartree
cpcmener: -0.03562860 hartree
kineticenergy: 2404.47389850 hartree
xcener: -144.457397064208 hartree
chargesum: -0.0000000
charge: -0.057077 -0.077297 -0.075014 0.939424 -0.328422 -0.343958 -0.349797 -0.622323 0.052045 0.127454 0.002868 -0.176443 -0.117320 -0.135354 0.090286 -0.066981 -0.111227 -0.120807 0.167854 0.126867 0.149401 0.158882 0.129973 0.125346 0.120114 0.123907 0.135029 0.132569
qa: -0.0571 -0.0773 -0.0750 0.9394 -0.3284 -0.3440 -0.3498 -0.6223 0.0520 0.1275 0.0029 -0.1764 -0.1173 -0.1354 0.0903 -0.0670 -0.1112 -0.1208 0.1679 0.1269 0.1494 0.1589 0.1300 0.1253 0.1201 0.1239 0.1350 0.1326
va: 1.2628 1.2259 1.2474 5.5938 2.0613 2.1104 2.0930 1.9871 3.5193 3.8168 3.9845 3.9432 4.0291 3.9952 3.8826 4.0474 3.8322 3.8182 0.9897 1.0196 1.0027 0.9964 0.9889 0.9895 0.9928 0.9897 0.9956 0.9881
dispcorr: -0.016288791 hartree
energy: -2410.159457910922
dipole: -23.99163 21.72307 -2.26856 -7.69969 7.80238 0.10268 -4.61063 2.55609 -2.05454
magnitude: 3.06236 au
magnitude: 7.78389 debye
