program: Orca
programVersion: 5.0.2
elementType: Cl Cl Cl P O O O O C C C C C C C C C C H H H H H H H H H H
charge: 0
multiplicity: 1
keywords: wb97x-d3
keywords: def2-TZVPP
keywords: def2/J RIJCOSX
keywords: DEFGRID2
keywords: scfconv7
keywords: smallprint printgap noloewdin
keywords: NOSOSCF
formula: C10H10Cl3O4P
InChI: InChI=1/C10H10Cl3O4P/c1-15-18(14,16-2)17-10(6-11)8-4-3-7(12)5-9(8)13/h3-6H,1-2H3
28 atoms
Cl 1.206929 1.14691 2.066314
Cl 3.974966 -2.265149 -0.989457
Cl 0.721984 3.518405 -0.659956
P  -2.191415 -0.799085 0.401959
O  -1.964787 0.740318 -0.034977
O  -3.736599 -0.770066 0.744862
O  -2.170722 -1.543686 -0.995217
O  -1.279861 -1.311376 1.443403
C  0.440598 0.464148 -0.43546
C  -0.741248 1.331427 -0.260435
C  1.38845 0.306186 0.57235
C  0.618548 -0.235174 -1.625058
C  2.483706 -0.52495 0.411023
C  1.70064 -1.077943 -1.809315
C  2.620144 -1.215099 -0.782651
C  -0.72798 2.654631 -0.341805
C  -4.201527 -0.242601 1.997775
C  -1.782856 -2.924286 -1.081711
H  -0.098151 -0.113287 -2.426013
H  3.211695 -0.636109 1.202413
H  1.82234 -1.613378 -2.740238
H  -1.614487 3.263064 -0.220959
H  -3.671288 -0.689119 2.837771
H  -5.255794 -0.492878 2.068823
H  -4.087013 0.840363 2.026565
H  -2.492586 -3.563012 -0.558581
H  -0.783612 -3.079604 -0.679768
H  -1.785872 -3.178589 -2.13711
elementType: Cl P O C H
totalener: -2410.14110923 hartree
nucrepener: 1992.75496699 hartree
electener: -4402.89607622 hartree
oneelecener: -7286.28844989 hartree
twoeener: 2883.39237368 hartree
cpcmener: -0.02921269 hartree
kineticenergy: 2404.49624088 hartree
xcener: -144.462096080676 hartree
chargesum: -0.0000000
charge: -0.059032 -0.077138 -0.080430 0.966134 -0.304155 -0.357725 -0.350189 -0.623707 -0.015805 0.136010 0.026905 -0.145788 -0.117984 -0.145591 0.096668 -0.075094 -0.113630 -0.115912 0.157756 0.127998 0.151464 0.159170 0.116256 0.129627 0.126548 0.139968 0.115295 0.132381
qa: -0.0590 -0.0771 -0.0804 0.9661 -0.3042 -0.3577 -0.3502 -0.6237 -0.0158 0.1360 0.0269 -0.1458 -0.1180 -0.1456 0.0967 -0.0751 -0.1136 -0.1159 0.1578 0.1280 0.1515 0.1592 0.1163 0.1296 0.1265 0.1400 0.1153 0.1324
va: 1.2617 1.2258 1.2387 5.5806 2.1469 2.1242 2.0777 1.9522 3.5628 3.8520 3.9322 3.9022 4.0451 3.9676 3.8749 4.0244 3.8370 3.8203 1.0046 1.0193 1.0018 0.9981 0.9941 0.9889 0.9890 0.9898 0.9918 0.9893
dispcorr: -0.016592106 hartree
energy: -2410.157701331883
dipole: -19.96787 18.55136 -1.41650 -11.06654 10.56611 -0.50043 -1.55573 0.64874 -0.90699
magnitude: 1.75486 au
magnitude: 4.46051 debye
