program: Orca
programVersion: 5.0.2
elementType: Cl Cl Cl P O O O O C C C C C C C C C C H H H H H H H H H H
charge: 0
multiplicity: 1
keywords: wb97x-d3
keywords: def2-TZVPP
keywords: def2/J RIJCOSX
keywords: DEFGRID2
keywords: scfconv7
keywords: smallprint printgap noloewdin
keywords: NOSOSCF
formula: C10H10Cl3O4P
InChI: InChI=1/C10H10Cl3O4P/c1-15-18(14,16-2)17-10(6-11)8-4-3-7(12)5-9(8)13/h3-6H,1-2H3
28 atoms
Cl 0.909601 0.662943 2.481891
Cl 4.285019 -1.966287 -0.740824
Cl 0.420424 3.532748 -1.118987
P  -2.100847 -0.820651 0.253321
O  -1.692397 0.706315 0.602561
O  -3.598057 -0.854892 0.762388
O  -2.241277 -0.737604 -1.320009
O  -1.202099 -1.858303 0.79632
C  0.602537 0.559752 -0.198078
C  -0.638574 1.335751 -0.028631
C  1.369641 0.167503 0.895454
C  1.00421 0.154659 -1.466822
C  2.50816 -0.603946 0.742386
C  2.135715 -0.620941 -1.64825
C  2.873566 -0.993589 -0.536387
C  -0.830969 2.589112 -0.417305
C  -3.908497 -1.060709 2.149357
C  -2.139812 -1.90419 -2.149626
H  0.413735 0.441372 -2.326897
H  3.095539 -0.895558 1.601973
H  2.430066 -0.932318 -2.640478
H  -1.778682 3.097426 -0.297378
H  -3.362917 -1.909977 2.558122
H  -4.974428 -1.261995 2.203724
H  -3.682307 -0.166144 2.728578
H  -2.108943 -1.550484 -3.175997
H  -3.008936 -2.547045 -2.01728
H  -1.231582 -2.465505 -1.936384
elementType: Cl P O C H
totalener: -2410.14215038 hartree
nucrepener: 1985.74634812 hartree
electener: -4395.88849850 hartree
oneelecener: -7272.41068771 hartree
twoeener: 2876.52218921 hartree
cpcmener: -0.02963242 hartree
kineticenergy: 2404.50328394 hartree
xcener: -144.461155175628 hartree
chargesum: 0.0000000
charge: -0.059810 -0.076517 -0.076257 0.969288 -0.317386 -0.358736 -0.342052 -0.627342 0.024334 0.089105 0.033157 -0.151751 -0.132784 -0.142453 0.102211 -0.064333 -0.110908 -0.115322 0.162336 0.128471 0.150143 0.157682 0.115860 0.129689 0.126902 0.130461 0.138240 0.117770
qa: -0.0598 -0.0765 -0.0763 0.9693 -0.3174 -0.3587 -0.3421 -0.6273 0.0243 0.0891 0.0332 -0.1518 -0.1328 -0.1425 0.1022 -0.0643 -0.1109 -0.1153 0.1623 0.1285 0.1501 0.1577 0.1159 0.1297 0.1269 0.1305 0.1382 0.1178
va: 1.2654 1.2267 1.2410 5.5776 2.1045 2.1234 2.0910 1.9505 3.5343 3.8712 3.9414 3.9222 4.0642 3.9894 3.8750 4.0569 3.8332 3.8213 0.9988 1.0194 1.0022 0.9992 0.9957 0.9887 0.9878 0.9886 0.9894 0.9949
dispcorr: -0.016292415 hartree
energy: -2410.158442797043
dipole: -19.33260 17.91442 -1.41818 -9.94171 9.81462 -0.12709 -4.25730 3.23747 -1.01983
magnitude: 1.75141 au
magnitude: 4.45174 debye
