program: Gaussian 09
title: 000065473
version: EM64L-G09RevD.01
frameworkgroup: C1[X(C9H10N2O2S)]
method: RPBEPBE
basis: SDD
operation: Freq
keyword: #p
keyword: freq=noraman
keyword: PBEPBE/SDD
title: #p freq=noraman PBEPBE/SDD
converged: NO YES NO NO
title: Mulliken charges:
elementType: S O O N N C C C C C C C C C H H H H H H H H H H
charge: 0.353886 -0.219114 -0.306163 -0.416336 -0.649194 -0.176350 -0.428533 0.566378 -0.521756 -0.595892 0.193670 -0.286791 -0.521973 0.272079 0.287093 0.222412 0.245127 0.257945 0.235600 0.299826 0.268775 0.271819 0.303967 0.343527
chargesum: 0.00000
title: Mulliken charges with hydrogens summed into heavy atoms:
elementType: S O O N N C C C C C C C C C
charge: 0.353886 -0.219114 -0.306163 -0.116510 -0.001700 0.110743 0.039005 0.566378 -0.028211 -0.595892 0.193670 -0.018016 -0.250154 0.272079
polarizability: 1.65943963e+02 -1.30271005e+00 1.38939104e+02 -9.28789871e+00 4.24827377e+00 8.86041934e+01
1716.lowfreq: -10.9418 -3.0570 -0.0027 -0.0011 0.0010 1.2943 22.6363 46.9862 67.9596
frequency: 22.3302 46.9719 67.9551 111.4281 148.2075 183.5852 192.4262 238.7248 254.9642 297.2140 338.3548 411.6646 432.1483 456.2248 467.8818 485.0077 511.2304 530.8924 555.6464 575.1582 642.7535 647.8977 690.3478 696.3252 718.6961 759.8585 780.1111 831.1247 885.7307 903.0910 932.0922 981.5395 1003.2328 1009.1749 1044.8551 1081.2650 1103.2286 1118.2883 1163.5960 1189.3620 1210.3792 1267.4419 1282.0434 1303.5187 1313.8512 1345.7828 1365.0207 1394.6310 1436.8004 1457.4109 1465.2118 1477.4100 1533.8405 1583.8203 1599.7804 1644.3519 2976.6781 3003.0721 3029.8870 3068.4189 3074.4887 3176.3587 3233.3196 3542.9118 3554.8780 3700.9742
redmass: 6.7210 5.6804 5.0353 5.3569 4.3790 2.8277 8.6004 9.1256 1.1147 5.3976 3.0502 3.5215 5.4088 3.9971 1.2626 3.0839 1.1554 4.9443 4.8018 3.2119 4.8555 5.0913 3.8377 3.7778 8.6609 1.5142 3.1388 3.0125 3.1026 1.3672 2.6406 3.2679 3.0294 2.1738 2.2609 1.6801 1.5153 2.2360 1.3472 1.4454 1.6501 1.6583 3.2797 1.3429 1.5876 1.7325 1.3857 3.8411 1.1317 4.6560 1.1373 2.4302 7.1993 10.5177 1.4398 3.0120 1.0666 1.0637 1.0837 1.0931 1.1010 1.0926 1.0992 1.0495 1.0738 1.1041
irintensity: 8.9714 8.5695 7.7020 2.7576 1.0621 4.9076 11.1144 4.1048 4.5892 0.8121 2.7364 1.7785 6.8145 4.0416 382.3848 10.7126 3.0389 6.3170 19.8859 7.3998 5.0000 9.7295 12.9335 7.6405 16.0172 46.6119 3.5153 44.2421 10.7170 6.1735 20.5128 12.9314 2.1700 2.9149 9.2019 4.1197 8.6985 8.5857 9.5854 27.1508 29.7944 41.7492 57.6203 13.9657 26.9860 58.4626 29.5515 3.5633 24.7979 73.8531 26.5370 579.5070 1.2622 243.6301 87.2732 288.4209 10.2135 23.8818 10.5251 15.6856 23.4753 2.0553 0.1425 42.7353 11.3434 39.6880
temp: 298.150 k
press: 1.00000 atm
elementType: 16 8 8 7 7 6 6 6 6 6 6 6 6 6 1 1 1 1 1 1 1 1 1 1
symmnumber: 1
zpe: 475831.8 jmol-1
zpe.correction: 0.181235 hartree
zpe.thermalcorrener: 0.194390 hartree
zpe.thermalcorrenthalpy: 0.195334 hartree
zpe.thermalcorrgfe: 0.140136 hartree
zpe.sumelectzpe: -1005.963436 hartree
zpe.sumelectthermal: -1005.950281 hartree
zpe.sumelectthermalent: -1005.949336 hartree
zpe.sumelectthermalfe: -1006.004535 hartree
dipole: 2.1186 -2.8455 2.7330
dipole: 4.4783
quadrupole: -100.8360 -86.0999 -84.9407
quadrupole: 10.2459 17.8095 -3.6943
quadrupole: -10.2105 4.5256 5.6849 10.2459 17.8095 -3.6943
hfenergy: -1006.1446708 hartree
pointgroup: C01 [X(C9H10N2O2S1)]
dipole: -0.877314 -1.028402 -1.1300165 debye
dipolederiv: -0.3145186 0.0675454 0.08072 0.0003382 0.0227716 0.019163 0.1334977 -0.0096967 0.1335983 -0.8021716 -0.3807533 0.123636 -0.1936497 -0.813056 0.0596585 0.1407966 0.1450187 -0.3561818 -0.9296054 -0.0296764 0.1629464 -0.0443139 -0.3742236 -0.0196455 0.2218217 -0.0091789 -0.9608132 -1.6686698 -0.0865847 -0.1527954 0.0788365 -0.5121499 -0.0838032 -0.0010561 -0.0626719 -0.3405918 -0.8604526 -0.037074 -0.4710453 -0.0507057 -0.7407249 -0.0193197 -0.6774197 -0.037565 -0.8540378 0.5464216 0.0486599 0.1689239 -0.1656954 0.3289515 0.1310255 0.4214649 0.0932142 0.3765905 0.0037115 -0.0093695 0.0110077 -0.0147133 -0.0344467 -0.0451692 -0.0746682 0.0166953 0.1025899 0.0515474 0.1480126 -0.0329549 -0.1566968 0.3214126 -0.0359968 0.0187157 -0.1217685 -0.0556684 -0.1832378 0.1229201 0.0609837 0.1586128 -0.1212254 -0.0161497 0.0154533 0.0305405 0.0820562 0.2177697 -0.3431349 -0.0696395 -0.3701239 -0.8155025 0.1272462 -0.1071525 0.1500377 -0.1374521 0.8649797 0.2206602 -0.1443688 0.2024088 1.5059366 -0.1093954 -0.151552 -0.1876937 0.1707732 -0.2646616 0.2542381 0.0089557 0.2266638 -0.2312691 -0.0397886 0.0440018 -0.067654 -0.1435567 0.2794548 -0.0442473 -0.1339829 0.2024886 -0.0701738 -0.0618057 -0.1589732 -0.0002814 -0.2344478 2.3508251 0.1641044 0.2587519 0.227908 0.3033457 0.0803865 0.131702 0.0616633 1.5248195 0.0862237 -0.0286812 0.0579812 -0.0169789 0.0124934 0.0296776 -0.0527765 0.0334796 0.0143349 0.0201754 -0.0471209 -0.1001195 -0.062614 0.0551228 0.0255154 -0.0724938 0.004256 -0.1191402 -0.0859057 0.113586 0.0501219 0.0996178 0.0224178 -0.0034921 0.0260386 0.0047174 0.0816282 0.0444974 -0.0580429 0.0016666 -0.0339266 -0.0873514 -0.0470479 0.0174989 -0.0697671 0.0849264 0.0211941 0.051216 -0.0541012 0.0122948 0.0988387 -0.0049984 -0.0382623 0.0210903 -0.0903599 0.1181823 -0.0274234 0.0234579 -0.0492176 0.2982222 0.0235701 0.0247966 -0.0058444 0.072409 0.0333056 -0.0986436 0.0510332 -0.0528061 0.054984 0.0154628 0.0539077 0.0290249 0.1638322 0.0871362 0.0157602 0.0292975 0.0347295 0.0060146 0.0037065 0.0246046 0.0092956 0.1971929 0.1621088 -0.0075632 0.0454162 -0.0120072 0.3804004 -0.0174149 0.0478089 -0.0147289 0.1153203 0.2216898 -0.0083877 0.0241078 -0.0204497 0.3892112 -0.0113851 0.0122451 -0.012183 0.1721782 unknown
polarizability: 166.2493548|0.2535945|139.0983491|-8.4446312|-1.6828795|88.1395568 unknown
InChI: InChI=1S/C9H10N2O2S/c10-9(13)11-6-1-2-7(12)8-5(6)3-4-14-8/h3-4,6,11H,1-2,10H2
charge 0 multiplicity 1
24 atoms
S  3.128698 -1.110905 -0.333453
O  2.910503 2.041107 -0.492762
O  -3.533892 -0.152257 0.863769
N  -1.638175 -0.098017 -0.501821
N  -3.790235 -0.272304 -1.452955
C  -0.718661 0.01516 0.652837
C  -0.427958 1.486183 1.060068
C  0.577642 -0.712644 0.337775
C  0.521778 2.206928 0.076463
C  1.731949 -0.005255 -0.021678
C  1.837358 1.451434 -0.16368
C  0.774863 -2.136468 0.353658
C  2.071397 -2.510266 0.023527
C  -3.01753 -0.171611 -0.296859
H  -1.241616 -0.475332 1.494366
H  0.027407 1.479842 2.069396
H  -1.388151 2.025067 1.138235
H  0.775391 3.222031 0.428228
H  0.026779 2.33168 -0.909298
H  -1.239463 -0.096887 -1.44132
H  -0.011543 -2.850837 0.609049
H  2.492466 -3.513304 -0.026525
H  -3.405048 -0.321088 -2.393407
H  -4.797457 -0.323956 -1.325612
