program: Orca
programVersion: 5.0.2
elementType: Cl Cl Cl P O O O O C C C C C C C C C C H H H H H H H H H H
charge: 0
multiplicity: 1
keywords: wb97x-d3
keywords: def2-TZVPP
keywords: def2/J RIJCOSX
keywords: DEFGRID2
keywords: scfconv7
keywords: smallprint printgap noloewdin
keywords: NOSOSCF
formula: C10H10Cl3O4P
InChI: InChI=1/C10H10Cl3O4P/c1-15-18(14,16-2)17-10(6-11)8-4-3-7(12)5-9(8)13/h3-6H,1-2H3
28 atoms
Cl 1.658622 0.868115 2.160801
Cl 4.156614 -2.353919 -1.311612
Cl -0.028704 2.883878 -1.626723
P  -2.611774 -0.477874 0.981049
O  -1.32342 0.465629 1.206007
O  -3.644618 0.551781 0.358152
O  -2.266183 -1.407581 -0.261708
O  -2.978666 -1.158764 2.23409
C  0.592214 0.172737 -0.221077
C  -0.586893 0.973499 0.154142
C  1.669161 0.033613 0.650079
C  0.648112 -0.485966 -1.444798
C  2.772805 -0.737407 0.326848
C  1.737185 -1.266577 -1.7921
C  2.788444 -1.3848 -0.89761
C  -0.944446 2.131106 -0.384285
C  -4.955927 0.118883 -0.032618
C  -1.685367 -2.705999 -0.074496
H  -0.177846 -0.393314 -2.137164
H  3.602819 -0.825571 1.014001
H  1.76026 -1.775447 -2.745746
H  -1.813086 2.688501 -0.060477
H  -5.492307 -0.320797 0.808135
H  -4.90543 -0.600217 -0.850158
H  -5.488694 1.003467 -0.370861
H  -1.455441 -3.08878 -1.065197
H  -2.391468 -3.378408 0.411623
H  -0.765824 -2.660732 0.509602
elementType: Cl P O C H
totalener: -2410.15298357 hartree
nucrepener: 1963.02412349 hartree
electener: -4373.17710706 hartree
oneelecener: -7225.67047343 hartree
twoeener: 2852.49336637 hartree
cpcmener: -0.02615540 hartree
kineticenergy: 2404.48361349 hartree
xcener: -144.454950837742 hartree
chargesum: -0.0000000
charge: -0.059846 -0.076144 -0.070522 0.918765 -0.329991 -0.332888 -0.343229 -0.607830 -0.004875 0.119211 0.059082 -0.163229 -0.145068 -0.124997 0.091823 -0.046870 -0.112492 -0.127932 0.159645 0.127549 0.147859 0.154801 0.120131 0.122664 0.126380 0.130307 0.137800 0.129898
qa: -0.0598 -0.0761 -0.0705 0.9188 -0.3300 -0.3329 -0.3432 -0.6078 -0.0049 0.1192 0.0591 -0.1632 -0.1451 -0.1250 0.0918 -0.0469 -0.1125 -0.1279 0.1596 0.1275 0.1479 0.1548 0.1201 0.1227 0.1264 0.1303 0.1378 0.1299
va: 1.2645 1.2269 1.2471 5.6131 2.0985 2.1075 2.0473 2.0151 3.5875 3.8290 3.9596 3.8821 4.0636 3.9824 3.8830 4.0951 3.8382 3.8264 1.0034 1.0198 1.0026 1.0030 0.9923 0.9910 0.9890 0.9879 0.9992 0.9816
dispcorr: -0.016327711 hartree
energy: -2410.169311283554
dipole: -21.21648 20.45674 -0.75974 -9.73711 9.11481 -0.62230 -4.12928 2.04797 -2.08132
magnitude: 2.30138 au
magnitude: 5.84964 debye
