program: Orca
programVersion: 5.0.2
elementType: Cl Cl Cl P O O O O C C C C C C C C C C H H H H H H H H H H
charge: 0
multiplicity: 1
keywords: wb97x-d3
keywords: def2-TZVPP
keywords: def2/J RIJCOSX
keywords: DEFGRID2
keywords: scfconv7
keywords: smallprint printgap noloewdin
keywords: NOSOSCF
formula: C10H10Cl3O4P
InChI: InChI=1/C10H10Cl3O4P/c1-15-18(14,16-2)17-10(6-11)8-4-3-7(12)5-9(8)13/h3-6H,1-2H3
28 atoms
Cl 1.13217 2.72088 -0.471762
Cl 4.785728 -0.609268 1.570455
Cl 0.213966 0.68935 -3.155605
P  -2.75425 -1.094676 0.29522
O  -1.690503 0.132247 0.249218
O  -2.341411 -1.97398 1.541114
O  -4.056655 -0.35067 0.805305
O  -2.829717 -1.875759 -0.949125
C  0.672121 0.068909 -0.139221
C  -0.686177 0.255387 -0.682076
C  1.576886 1.119606 -0.007201
C  1.068218 -1.194842 0.292392
C  2.846017 0.921367 0.514573
C  2.327094 -1.418157 0.818738
C  3.206564 -0.35204 0.920132
C  -0.989636 0.529663 -1.943491
C  -2.122509 -1.432362 2.850857
C  -4.676204 0.678189 0.022215
H  0.385095 -2.029538 0.197208
H  3.535857 1.748915 0.607091
H  2.61563 -2.409788 1.138227
H  -2.005048 0.674813 -2.288504
H  -1.366065 -0.647515 2.838544
H  -1.768252 -2.252214 3.470137
H  -3.047183 -1.041189 3.274301
H  -5.618043 0.917589 0.509359
H  -4.879303 0.337916 -0.993338
H  -4.054747 1.573345 -0.008118
elementType: Cl P O C H
totalener: -2410.15243000 hartree
nucrepener: 1940.46779588 hartree
electener: -4350.62022588 hartree
oneelecener: -7180.57101832 hartree
twoeener: 2829.95079244 hartree
cpcmener: -0.02655635 hartree
kineticenergy: 2404.47258918 hartree
xcener: -144.455181314143 hartree
chargesum: 0.0000000
charge: -0.059574 -0.076656 -0.072091 0.929245 -0.346514 -0.347160 -0.335285 -0.602073 0.026512 0.156548 0.009848 -0.145184 -0.121503 -0.151710 0.089679 -0.045690 -0.110483 -0.116555 0.149111 0.127643 0.147054 0.146448 0.117774 0.128738 0.126034 0.130955 0.121603 0.123289
qa: -0.0596 -0.0767 -0.0721 0.9292 -0.3465 -0.3472 -0.3353 -0.6021 0.0265 0.1565 0.0098 -0.1452 -0.1215 -0.1517 0.0897 -0.0457 -0.1105 -0.1166 0.1491 0.1276 0.1471 0.1464 0.1178 0.1287 0.1260 0.1310 0.1216 0.1233
va: 1.2618 1.2260 1.2479 5.5866 2.0569 2.1036 2.1062 2.0078 3.6131 3.7843 3.9678 3.8997 4.0361 4.0126 3.8838 4.0866 3.8314 3.8385 1.0157 1.0192 1.0044 0.9995 0.9894 0.9888 0.9950 0.9900 0.9906 0.9894
dispcorr: -0.015381507 hartree
energy: -2410.167811506040
dipole: -20.85537 20.14440 -0.71097 -5.60207 6.55444 0.95236 10.68241 -9.00025 1.68216
magnitude: 2.05965 au
magnitude: 5.23521 debye
