program: Orca
programVersion: 5.0.2
elementType: Cl Cl Cl P O O O O C C C C C C C C C C H H H H H H H H H H
charge: 0
multiplicity: 1
keywords: wb97x-d3
keywords: def2-TZVPP
keywords: def2/J RIJCOSX
keywords: DEFGRID2
keywords: scfconv7
keywords: smallprint printgap noloewdin
keywords: NOSOSCF
formula: C10H10Cl3O4P
InChI: InChI=1/C10H10Cl3O4P/c1-15-18(14,16-2)17-10(6-11)8-4-3-7(12)5-9(8)13/h3-6H,1-2H3
28 atoms
Cl 1.501632 2.584517 -0.952289
Cl 4.967677 -0.661351 1.506578
Cl 0.206036 0.291905 -3.14928
P  -2.741528 -0.61397 0.552766
O  -1.470709 0.378742 0.428915
O  -3.060886 -0.526293 2.102819
O  -3.876417 0.28509 -0.086784
O  -2.53308 -1.960172 -0.011094
C  0.829282 0.097486 -0.103899
C  -0.545972 0.309007 -0.589413
C  1.829686 1.059162 -0.216209
C  1.139828 -1.09976 0.536894
C  3.107806 0.834154 0.27165
C  2.405748 -1.347707 1.032676
C  3.380264 -0.37304 0.890618
C  -0.918441 0.413933 -1.858468
C  -2.419537 -1.414318 3.030383
C  -5.19857 -0.233695 -0.289247
H  0.377413 -1.862081 0.63578
H  3.8723 1.592433 0.17506
H  2.626211 -2.287814 1.51814
H  -1.941143 0.585254 -2.168369
H  -2.660775 -2.453245 2.811298
H  -2.800365 -1.158974 4.014786
H  -1.337612 -1.280603 3.023374
H  -5.668397 -0.491193 0.659587
H  -5.183453 -1.106938 -0.940223
H  -5.771327 0.556624 -0.765939
elementType: Cl P O C H
totalener: -2410.15227072 hartree
nucrepener: 1924.90953969 hartree
electener: -4335.06181040 hartree
oneelecener: -7149.97446731 hartree
twoeener: 2814.91265691 hartree
cpcmener: -0.02390271 hartree
kineticenergy: 2404.48935795 hartree
xcener: -144.456528263192 hartree
chargesum: 0.0000000
charge: -0.058852 -0.076935 -0.071958 0.944060 -0.332164 -0.342034 -0.346345 -0.604266 0.054046 0.125777 0.004327 -0.148365 -0.116770 -0.156188 0.089085 -0.037006 -0.113728 -0.121662 0.144497 0.126758 0.146878 0.144923 0.120148 0.129934 0.121615 0.125345 0.120934 0.127950
qa: -0.0589 -0.0769 -0.0720 0.9441 -0.3322 -0.3420 -0.3463 -0.6043 0.0540 0.1258 0.0043 -0.1484 -0.1168 -0.1562 0.0891 -0.0370 -0.1137 -0.1217 0.1445 0.1268 0.1469 0.1449 0.1201 0.1299 0.1216 0.1253 0.1209 0.1279
va: 1.2626 1.2259 1.2462 5.5898 2.1110 2.1042 2.1191 1.9699 3.5904 3.8251 3.9710 3.9285 4.0286 4.0246 3.8822 4.0595 3.8419 3.8457 1.0187 1.0192 1.0049 1.0096 0.9941 0.9910 0.9844 0.9899 0.9924 0.9892
dispcorr: -0.014597490 hartree
energy: -2410.166868206784
dipole: -24.03560 22.74510 -1.29050 -9.88701 9.61385 -0.27316 11.35829 -10.12663 1.23167
magnitude: 1.80472 au
magnitude: 4.58723 debye
