program: Orca
programVersion: 5.0.2
elementType: Cl Cl Cl P O O O O C C C C C C C C C C H H H H H H H H H H
charge: 0
multiplicity: 1
keywords: wb97x-d3
keywords: def2-TZVPP
keywords: def2/J RIJCOSX
keywords: DEFGRID2
keywords: scfconv7
keywords: smallprint printgap noloewdin
keywords: NOSOSCF
formula: C10H10Cl3O4P
InChI: InChI=1/C10H10Cl3O4P/c1-15-18(14,16-2)17-10(6-11)8-4-3-7(12)5-9(8)13/h3-6H,1-2H3
28 atoms
Cl 0.15029 1.772731 1.581629
Cl 4.22141 -1.673021 1.232448
Cl 0.428661 3.197898 -1.526628
P  -2.465244 -0.939892 -0.37795
O  -1.658953 -0.12169 -1.514298
O  -1.421435 -1.877577 0.366184
O  -2.708178 0.203446 0.686003
O  -3.612869 -1.626615 -0.993287
C  0.559854 0.208222 -0.600035
C  -0.646502 0.770144 -1.232679
C  1.006259 0.590118 0.662496
C  1.2626 -0.791717 -1.269164
C  2.132476 0.017161 1.234052
C  2.385636 -1.380399 -0.719804
C  2.813157 -0.961185 0.530471
C  -0.809959 2.018097 -1.650283
C  -1.126034 -3.187797 -0.13128
C  -3.115276 -0.071663 2.032362
H  0.926206 -1.11028 -2.247475
H  2.465618 0.326392 2.21513
H  2.91987 -2.147957 -1.262209
H  -1.724644 2.358227 -2.1184
H  -0.33464 -3.587894 0.496732
H  -0.776532 -3.158778 -1.163533
H  -1.998718 -3.83662 -0.063855
H  -4.014433 -0.687864 2.057613
H  -3.332156 0.887589 2.494611
H  -2.319545 -0.564007 2.589839
elementType: Cl P O C H
totalener: -2410.15160547 hartree
nucrepener: 2012.21595834 hartree
electener: -4422.36756381 hartree
oneelecener: -7324.08338485 hartree
twoeener: 2901.71582104 hartree
cpcmener: -0.02614347 hartree
kineticenergy: 2404.49775878 hartree
xcener: -144.460800393478 hartree
chargesum: 0.0000000
charge: -0.060598 -0.075851 -0.071210 0.899423 -0.327774 -0.324834 -0.319815 -0.611414 0.041617 0.105969 0.028483 -0.165336 -0.119966 -0.139871 0.094877 -0.053152 -0.127640 -0.126236 0.154126 0.125166 0.146737 0.155221 0.129054 0.125675 0.134133 0.133820 0.129802 0.119596
qa: -0.0606 -0.0759 -0.0712 0.8994 -0.3278 -0.3248 -0.3198 -0.6114 0.0416 0.1060 0.0285 -0.1653 -0.1200 -0.1399 0.0949 -0.0532 -0.1276 -0.1262 0.1541 0.1252 0.1467 0.1552 0.1291 0.1257 0.1341 0.1338 0.1298 0.1196
va: 1.2569 1.2273 1.2521 5.6089 2.0927 2.0489 2.0905 2.0179 3.5324 3.8058 3.9448 3.8756 4.0501 3.9768 3.8808 4.0725 3.8333 3.8330 1.0012 1.0198 1.0030 0.9986 0.9881 0.9842 1.0000 0.9928 0.9877 0.9928
dispcorr: -0.017395770 hartree
energy: -2410.169001240371
dipole: -11.90882 12.80730 0.89849 -14.28122 13.49336 -0.78786 1.40210 -0.53882 0.86328
magnitude: 1.47420 au
magnitude: 3.74711 debye
