program: Orca
programVersion: 5.0.2
elementType: Cl Cl Cl P O O O O C C C C C C C C C C H H H H H H H H H H
charge: 0
multiplicity: 1
keywords: wb97x-d3
keywords: def2-TZVPP
keywords: def2/J RIJCOSX
keywords: DEFGRID2
keywords: scfconv7
keywords: smallprint printgap noloewdin
keywords: NOSOSCF
formula: C10H10Cl3O4P
InChI: InChI=1/C10H10Cl3O4P/c1-15-18(14,16-2)17-10(6-11)8-4-3-7(12)5-9(8)13/h3-6H,1-2H3
28 atoms
Cl 0.075044 1.72505 1.585088
Cl 4.300666 -1.540129 1.31903
Cl 0.390313 3.154753 -1.523895
P  -2.47901 -0.995683 -0.429457
O  -1.596226 -0.22776 -1.544278
O  -1.481043 -1.851917 0.46275
O  -2.852899 0.198672 0.533501
O  -3.553162 -1.747418 -1.0993
C  0.592491 0.176212 -0.582833
C  -0.618488 0.696148 -1.243208
C  0.999459 0.578016 0.687033
C  1.353084 -0.789183 -1.238933
C  2.139111 0.056432 1.280268
C  2.492135 -1.3260 -0.668547
C  2.87645 -0.889941 0.589626
C  -0.807786 1.936392 -1.673029
C  -1.015641 -3.130148 0.011903
C  -3.319486 0.000967 1.873915
H  1.052885 -1.119204 -2.2251
H  2.439967 0.380846 2.266909
H  3.072732 -2.065628 -1.202152
H  -1.719418 2.246625 -2.167223
H  -0.589269 -3.075857 -0.99028
H  -1.822948 -3.861985 0.021842
H  -0.239597 -3.442147 0.706136
H  -2.522763 -0.375979 2.513439
H  -4.167537 -0.683596 1.903562
H  -3.638381 0.973718 2.238369
elementType: Cl P O C H
totalener: -2410.15187366 hartree
nucrepener: 2008.58313549 hartree
electener: -4418.73500915 hartree
oneelecener: -7316.74895668 hartree
twoeener: 2898.01394753 hartree
cpcmener: -0.02643507 hartree
kineticenergy: 2404.48709284 hartree
xcener: -144.458860215705 hartree
chargesum: 0.0000000
charge: -0.060468 -0.075981 -0.070546 0.897915 -0.329395 -0.324020 -0.322162 -0.610297 0.038332 0.108127 0.027297 -0.168602 -0.116344 -0.134195 0.089673 -0.051138 -0.130320 -0.119687 0.153876 0.125743 0.147330 0.155451 0.125074 0.136671 0.129271 0.116432 0.132539 0.129425
qa: -0.0605 -0.0760 -0.0705 0.8979 -0.3294 -0.3240 -0.3222 -0.6103 0.0383 0.1081 0.0273 -0.1686 -0.1163 -0.1342 0.0897 -0.0511 -0.1303 -0.1197 0.1539 0.1257 0.1473 0.1555 0.1251 0.1367 0.1293 0.1164 0.1325 0.1294
va: 1.2584 1.2271 1.2527 5.6146 2.0887 2.0519 2.0920 2.0190 3.5458 3.7988 3.9400 3.8744 4.0455 3.9754 3.8855 4.0746 3.8364 3.8329 1.0016 1.0195 1.0026 0.9985 0.9835 0.9988 0.9878 0.9942 0.9925 0.9874
dispcorr: -0.017385411 hartree
energy: -2410.169259067784
dipole: -11.79837 12.72352 0.92516 -13.79839 13.17522 -0.62317 1.37203 -0.43687 0.93516
magnitude: 1.45560 au
magnitude: 3.69985 debye
