program: Orca
programVersion: 5.0.2
elementType: Cl Cl Cl P O O O O C C C C C C C C C C H H H H H H H H H H
charge: 0
multiplicity: 1
keywords: wb97x-d3
keywords: def2-TZVPP
keywords: def2/J RIJCOSX
keywords: DEFGRID2
keywords: scfconv7
keywords: smallprint printgap noloewdin
keywords: NOSOSCF
formula: C10H10Cl3O4P
InChI: InChI=1/C10H10Cl3O4P/c1-15-18(14,16-2)17-10(6-11)8-4-3-7(12)5-9(8)13/h3-6H,1-2H3
28 atoms
Cl -0.12874 1.587749 1.55416
Cl 4.280515 -1.440976 1.524434
Cl 0.318826 3.118174 -1.558041
P  -2.379523 -1.102842 -0.517873
O  -1.466135 -0.380074 -1.639053
O  -1.414122 -1.552061 0.658541
O  -3.115463 0.148642 0.109448
O  -3.174396 -2.172324 -1.143629
C  0.655135 0.164875 -0.614036
C  -0.556766 0.610098 -1.326895
C  0.938445 0.538533 0.697001
C  1.520421 -0.724676 -1.244299
C  2.054315 0.056494 1.361707
C  2.642022 -1.22001 -0.60387
C  2.895403 -0.821659 0.698335
C  -0.800849 1.835149 -1.770025
C  -0.73408 -2.812046 0.614762
C  -3.864054 0.069473 1.329335
H  1.313358 -1.03554 -2.26032
H  2.254738 0.352871 2.382109
H  3.302327 -1.906974 -1.114619
H  -1.707248 2.096671 -2.300885
H  -0.069029 -2.836938 1.473426
H  -0.143596 -2.921031 -0.294458
H  -1.441694 -3.636765 0.686595
H  -4.595621 -0.73815 1.296625
H  -4.387922 1.016044 1.434259
H  -3.203888 -0.069171 2.184584
elementType: Cl P O C H
totalener: -2410.15179124 hartree
nucrepener: 2016.73453428 hartree
electener: -4426.88632552 hartree
oneelecener: -7333.04479993 hartree
twoeener: 2906.15847441 hartree
cpcmener: -0.02576990 hartree
kineticenergy: 2404.49721184 hartree
xcener: -144.460541665142 hartree
chargesum: 0.0000000
charge: -0.060772 -0.077296 -0.069859 0.900470 -0.331139 -0.322399 -0.324685 -0.610413 0.019048 0.103923 0.046102 -0.166937 -0.122326 -0.125953 0.082652 -0.042365 -0.132312 -0.109904 0.150500 0.126882 0.148096 0.155812 0.129111 0.126015 0.139746 0.126251 0.127663 0.114089
qa: -0.0608 -0.0773 -0.0699 0.9005 -0.3311 -0.3224 -0.3247 -0.6104 0.0190 0.1039 0.0461 -0.1669 -0.1223 -0.1260 0.0827 -0.0424 -0.1323 -0.1099 0.1505 0.1269 0.1481 0.1558 0.1291 0.1260 0.1397 0.1263 0.1277 0.1141
va: 1.2617 1.2254 1.2523 5.6164 2.0992 2.0571 2.0995 2.0182 3.5945 3.8169 3.8840 3.9031 4.0385 3.9628 3.8811 4.0719 3.8333 3.8361 1.0029 1.0197 1.0021 0.9982 0.9872 0.9820 1.0006 0.9922 0.9881 0.9955
dispcorr: -0.017789973 hartree
energy: -2410.169581209904
dipole: -11.96637 12.58421 0.61784 -12.27517 12.11195 -0.16322 1.67950 -0.63917 1.04033
magnitude: 1.22092 au
magnitude: 3.10333 debye
