program: Orca
programVersion: 5.0.2
elementType: Cl Cl Cl P O O O O C C C C C C C C C C H H H H H H H H H H
charge: 0
multiplicity: 1
keywords: wb97x-d3
keywords: def2-TZVPP
keywords: def2/J RIJCOSX
keywords: DEFGRID2
keywords: scfconv7
keywords: smallprint printgap noloewdin
keywords: NOSOSCF
formula: C10H10Cl3O4P
InChI: InChI=1/C10H10Cl3O4P/c1-15-18(14,16-2)17-10(6-11)8-4-3-7(12)5-9(8)13/h3-6H,1-2H3
28 atoms
Cl -0.128389 0.183426 -2.329297
Cl 4.13903 -2.19836 -0.165805
Cl 0.366847 3.375536 -1.103277
P  -2.382393 -0.370859 1.124138
O  -1.508964 0.967855 1.36666
O  -2.82067 -0.171853 -0.381412
O  -1.362114 -1.584516 1.022103
O  -3.413393 -0.486888 2.16939
C  0.604813 0.565286 0.255221
C  -0.574954 1.42575 0.459644
C  0.890252 -0.055068 -0.958284
C  1.439072 0.30018 1.338568
C  1.979506 -0.900936 -1.099211
C  2.529894 -0.541409 1.225164
C  2.786965 -1.136217 0.000142
C  -0.777019 2.625327 -0.067483
C  -3.419185 -1.226595 -1.145098
C  -0.854799 -2.210443 2.20689
H  1.233391 0.768784 2.292515
H  2.184488 -1.375919 -2.048778
H  3.166518 -0.726753 2.079053
H  -1.666708 3.207847 0.134243
H  -2.699971 -2.018414 -1.349831
H  -3.74212 -0.786675 -2.084729
H  -4.286402 -1.643587 -0.632425
H  -0.379671 -1.48977 2.872468
H  -0.111734 -2.933835 1.883878
H  -1.64832 -2.728162 2.744285
elementType: Cl P O C H
totalener: -2410.15144252 hartree
nucrepener: 2016.51065726 hartree
electener: -4426.66209978 hartree
oneelecener: -7332.65965120 hartree
twoeener: 2905.99755142 hartree
cpcmener: -0.02610757 hartree
kineticenergy: 2404.49541242 hartree
xcener: -144.460095527016 hartree
chargesum: -0.0000000
charge: -0.060432 -0.076780 -0.070709 0.899335 -0.329469 -0.319102 -0.322035 -0.611922 0.037183 0.098851 0.034479 -0.170828 -0.121223 -0.135434 0.091943 -0.046628 -0.125138 -0.130673 0.155014 0.127962 0.148197 0.154777 0.120601 0.129865 0.131694 0.125915 0.128643 0.135915
qa: -0.0604 -0.0768 -0.0707 0.8993 -0.3295 -0.3191 -0.3220 -0.6119 0.0372 0.0989 0.0345 -0.1708 -0.1212 -0.1354 0.0919 -0.0466 -0.1251 -0.1307 0.1550 0.1280 0.1482 0.1548 0.1206 0.1299 0.1317 0.1259 0.1286 0.1359
va: 1.2583 1.2260 1.2520 5.6132 2.0924 2.0923 2.0542 2.0195 3.5584 3.8128 3.9303 3.8723 4.0494 3.9719 3.8791 4.0773 3.8308 3.8373 1.0009 1.0191 1.0026 0.9985 0.9934 0.9872 0.9937 0.9830 0.9874 1.0002
dispcorr: -0.017622311 hartree
energy: -2410.169064828487
dipole: -11.10896 11.97104 0.86208 -10.53903 9.49028 -1.04875 9.32338 -9.57531 -0.25193
magnitude: 1.38077 au
magnitude: 3.50964 debye
