program: Orca
programVersion: 5.0.2
elementType: Cl Cl Cl P O O O O C C C C C C C C C C H H H H H H H H H H
charge: 0
multiplicity: 1
keywords: wb97x-d3
keywords: def2-TZVPP
keywords: def2/J RIJCOSX
keywords: DEFGRID2
keywords: scfconv7
keywords: smallprint printgap noloewdin
keywords: NOSOSCF
formula: C10H10Cl3O4P
InChI: InChI=1/C10H10Cl3O4P/c1-15-18(14,16-2)17-10(6-11)8-4-3-7(12)5-9(8)13/h3-6H,1-2H3
28 atoms
Cl 1.185689 -0.760145 2.411362
Cl 3.955794 -1.40513 -2.125443
Cl 0.474033 3.597457 0.677392
P  -2.437502 -0.655389 0.330087
O  -1.555434 0.292561 1.298286
O  -2.525576 0.1058 -1.063818
O  -1.418128 -1.823514 0.021041
O  -3.716861 -1.003775 0.970471
C  0.561381 0.52434 0.116734
C  -0.573162 1.13728 0.828193
C  1.411438 -0.383859 0.742312
C  0.788865 0.820761 -1.223204
C  2.460335 -0.981966 0.065824
C  1.8295 0.237154 -1.923894
C  2.654027 -0.662147 -1.268543
C  -0.719872 2.431196 1.084701
C  -3.523403 1.113072 -1.283726
C  -1.791087 -2.931617 -0.811047
H  0.135642 1.5171 -1.731893
H  3.114196 -1.679982 0.570178
H  1.987184 0.479302 -2.965594
H  -1.588682 2.826834 1.594747
H  -3.372072 1.970011 -0.626561
H  -4.526422 0.714026 -1.135567
H  -3.417327 1.436058 -2.316149
H  -1.939462 -2.612071 -1.842519
H  -2.6961 -3.414873 -0.443094
H  -0.967815 -3.639832 -0.772611
elementType: Cl P O C H
totalener: -2410.15226862 hartree
nucrepener: 1992.75742909 hartree
electener: -4402.90969771 hartree
oneelecener: -7285.33208558 hartree
twoeener: 2882.42238787 hartree
cpcmener: -0.02673529 hartree
kineticenergy: 2404.48906406 hartree
xcener: -144.456424040273 hartree
chargesum: 0.0000000
charge: -0.060244 -0.075958 -0.072592 0.908062 -0.320847 -0.329397 -0.316531 -0.613196 0.033200 0.066816 0.051868 -0.154521 -0.132943 -0.145430 0.093402 -0.041742 -0.110603 -0.112819 0.158753 0.126356 0.146320 0.156291 0.122413 0.125687 0.126808 0.123684 0.123261 0.123903
qa: -0.0602 -0.0760 -0.0726 0.9081 -0.3208 -0.3294 -0.3165 -0.6132 0.0332 0.0668 0.0519 -0.1545 -0.1329 -0.1454 0.0934 -0.0417 -0.1106 -0.1128 0.1588 0.1264 0.1463 0.1563 0.1224 0.1257 0.1268 0.1237 0.1233 0.1239
va: 1.2649 1.2274 1.2452 5.6014 2.0903 2.0529 2.1046 2.0206 3.5152 3.8865 3.9159 3.9687 4.0544 4.0138 3.8797 4.0424 3.8328 3.8332 0.9984 1.0205 1.0039 1.0000 0.9812 1.0001 0.9901 0.9906 0.9943 0.9890
dispcorr: -0.016776729 hartree
energy: -2410.169045349796
dipole: -17.94565 17.94459 -0.00106 -3.69369 4.13781 0.44412 -10.77922 8.69314 -2.08608
magnitude: 2.13284 au
magnitude: 5.42124 debye
