program: Orca
programVersion: 5.0.2
elementType: Cl Cl Cl P O O O O C C C C C C C C C C H H H H H H H H H H
charge: 0
multiplicity: 1
keywords: wb97x-d3
keywords: def2-TZVPP
keywords: def2/J RIJCOSX
keywords: DEFGRID2
keywords: scfconv7
keywords: smallprint printgap noloewdin
keywords: NOSOSCF
formula: C10H10Cl3O4P
InChI: InChI=1/C10H10Cl3O4P/c1-15-18(14,16-2)17-10(6-11)8-4-3-7(12)5-9(8)13/h3-6H,1-2H3
28 atoms
Cl 0.50585 1.653099 1.821719
Cl 4.163115 -2.001836 0.461646
Cl 0.719594 3.284307 -1.402464
P  -2.481742 -0.804332 -0.130759
O  -1.976581 0.488242 -0.948315
O  -1.699573 -1.961588 -0.877211
O  -1.78875 -0.761894 1.296624
O  -3.954022 -0.855617 -0.139867
C  0.451185 0.341352 -0.546593
C  -0.753577 1.113818 -0.912582
C  1.103175 0.517085 0.670831
C  0.978819 -0.581181 -1.445266
C  2.244887 -0.198341 0.993048
C  2.116821 -1.309335 -1.14896
C  2.737819 -1.107981 0.072908
C  -0.739284 2.384638 -1.294512
C  -1.846572 -3.329452 -0.472007
C  -2.456404 -0.177601 2.424012
H  0.497299 -0.723082 -2.403648
H  2.737484 -0.047458 1.943757
H  2.513579 -2.016179 -1.864287
H  -1.634753 2.924102 -1.574406
H  -1.354006 -3.506544 0.483938
H  -1.367487 -3.934335 -1.237429
H  -2.896646 -3.613647 -0.401235
H  -2.606686 0.892903 2.285902
H  -1.812761 -0.340383 3.284349
H  -3.417546 -0.659232 2.602632
elementType: Cl P O C H
totalener: -2410.15026465 hartree
nucrepener: 2005.95623407 hartree
electener: -4416.10649872 hartree
oneelecener: -7311.62004024 hartree
twoeener: 2895.51354152 hartree
cpcmener: -0.02482036 hartree
kineticenergy: 2404.48081649 hartree
xcener: -144.459501715887 hartree
chargesum: -0.0000000
charge: -0.063432 -0.075960 -0.077521 0.893762 -0.298548 -0.324818 -0.327494 -0.613674 -0.026910 0.141028 0.058904 -0.131455 -0.128304 -0.147110 0.097872 -0.077973 -0.113970 -0.129734 0.150080 0.127549 0.147930 0.154987 0.123087 0.126283 0.125327 0.128740 0.130467 0.130889
qa: -0.0634 -0.0760 -0.0775 0.8938 -0.2985 -0.3248 -0.3275 -0.6137 -0.0269 0.1410 0.0589 -0.1315 -0.1283 -0.1471 0.0979 -0.0780 -0.1140 -0.1297 0.1501 0.1275 0.1479 0.1550 0.1231 0.1263 0.1253 0.1287 0.1305 0.1309
va: 1.2570 1.2273 1.2428 5.6061 2.1310 2.0963 2.0472 2.0108 3.5621 3.8425 3.9080 3.9115 4.0511 3.9828 3.8800 4.0395 3.8297 3.8215 1.0065 1.0194 1.0024 1.0002 0.9913 0.9894 0.9951 0.9857 0.9880 1.0027
dispcorr: -0.017092169 hartree
energy: -2410.167356815378
dipole: -13.92043 14.71394 0.79350 -13.47872 12.42172 -1.05700 1.85543 -1.31154 0.54389
magnitude: 1.42923 au
magnitude: 3.63283 debye
