program: Orca
programVersion: 5.0.2
elementType: Cl Cl Cl P O O O O C C C C C C C C C C H H H H H H H H H H
charge: 0
multiplicity: 1
keywords: wb97x-d3
keywords: def2-TZVPP
keywords: def2/J RIJCOSX
keywords: DEFGRID2
keywords: scfconv7
keywords: smallprint printgap noloewdin
keywords: NOSOSCF
formula: C10H10Cl3O4P
InChI: InChI=1/C10H10Cl3O4P/c1-15-18(14,16-2)17-10(6-11)8-4-3-7(12)5-9(8)13/h3-6H,1-2H3
28 atoms
Cl 0.35617 1.62275 1.909226
Cl 4.370062 -1.697897 0.705603
Cl 0.39612 3.386301 -1.098537
P  -2.12378 -1.191002 -0.249456
O  -1.815971 0.155366 -1.098937
O  -1.940222 -0.705121 1.244176
O  -3.69941 -1.267858 -0.398646
O  -1.36142 -2.382964 -0.664989
C  0.533496 0.343368 -0.475967
C  -0.732077 0.974289 -0.895451
C  1.110197 0.569412 0.771729
C  1.172663 -0.537191 -1.346053
C  2.292017 -0.052214 1.144524
C  2.353687 -1.165384 -0.999863
C  2.899157 -0.916659 0.249737
C  -0.898987 2.261051 -1.173656
C  -1.361591 -1.564185 2.237947
C  -4.308038 -1.736137 -1.610558
H  0.742351 -0.726263 -2.320875
H  2.724799 0.133483 2.117888
H  2.83739 -1.837778 -1.694466
H  -1.847957 2.671549 -1.493472
H  -0.359489 -1.884193 1.953809
H  -1.98769 -2.439125 2.412198
H  -1.305208 -0.981697 3.153196
H  -5.365403 -1.871143 -1.397455
H  -3.884729 -2.688582 -1.929186
H  -4.197282 -1.002104 -2.409246
elementType: Cl P O C H
totalener: -2410.14997155 hartree
nucrepener: 1999.43660064 hartree
electener: -4409.58657218 hartree
oneelecener: -7299.22363556 hartree
twoeener: 2889.63706338 hartree
cpcmener: -0.02325971 hartree
kineticenergy: 2404.48236874 hartree
xcener: -144.459106857513 hartree
chargesum: 0.0000000
charge: -0.058474 -0.075394 -0.076450 0.945155 -0.312851 -0.339810 -0.353420 -0.600870 0.051937 0.139229 -0.023462 -0.176975 -0.102347 -0.121675 0.082144 -0.079203 -0.125228 -0.113590 0.153461 0.127266 0.148567 0.154198 0.118774 0.143060 0.129201 0.127278 0.114750 0.124727
qa: -0.0585 -0.0754 -0.0765 0.9452 -0.3129 -0.3398 -0.3534 -0.6009 0.0519 0.1392 -0.0235 -0.1770 -0.1023 -0.1217 0.0821 -0.0792 -0.1252 -0.1136 0.1535 0.1273 0.1486 0.1542 0.1188 0.1431 0.1292 0.1273 0.1147 0.1247
va: 1.2596 1.2280 1.2444 5.5966 2.1166 2.0795 2.1254 1.9818 3.5298 3.8318 3.9214 3.9434 4.0048 3.9755 3.8961 4.0397 3.8247 3.8409 1.0044 1.0196 1.0017 1.0001 0.9869 0.9933 0.9924 0.9885 0.9949 0.9883
dispcorr: -0.016856037 hartree
energy: -2410.166827582205
dipole: -16.95291 15.97982 -0.97308 -13.14770 12.89912 -0.24858 -3.39576 3.24583 -0.14993
magnitude: 1.01546 au
magnitude: 2.58110 debye
